{"text_format":"1","workbook":"xlsx","n_sheets":6,"sheets":["RICHIESTA","CONTRIBUTO","CostoParametrico","LookupTable","SpeseTecniche","Versioni"],"not_rendered":{"charts":0,"images":0,"macros":1,"external_links":1,"defined_names":39,"comments":1,"pivot_tables":0},"unopened":[],"bounds":{"document_bytes":16777216,"sheet_cells":100000,"rows_first":2000,"rows_last":500,"rows_between":2000,"halvings":0,"cell_chars":16384,"cell_head_chars":4096},"cells_cut":0,"cells_raw":0,"read":"whole","date_system":"1900"}

{"sheet":"RICHIESTA","index":0,"n_rows":241,"n_cols":63,"rows_kept":241,"cut":false,"hidden":false,"merged":[[139,25,139,28],[139,29,139,32]]}
[]
[null,null,null,null,null,null,null,null,null,null,null,"S"]
[null,null,null,null,null,null,null,null,null,null,null,"N"]
[]
[]
["A","LOCALIZZAZIONE"]
[]
[null,"REGIONE",{"$f":"VLOOKUP(C9,LookupTable!A:J,3,FALSE)","v":"Lazio"},null,{"$f":"VLOOKUP(C9,LookupTable!A:J,6,FALSE)","v":12},null,null,null,"COMUNI","INTERNE"]
[null,"COMUNE","Accumoli",{"$f":"VLOOKUP(C9,LookupTable!A:J,2,FALSE)","v":"RI"},{"$f":"VLOOKUP(C9,LookupTable!A:J,10,FALSE)","v":"057001"},null,"CRATERE",{"$f":"VLOOKUP(C9,LookupTable!A:J,4,FALSE)","v":true},1,1,"PRIME"]
[null,"CENTRO STORICO",false,null,null,null,"CENTRO STORICO-BORGO TIPICO",{"$f":"C10","v":false},{"$f":"IF(OR(H9,H10,E140),100%,50%)","v":1},{"$f":"IF(OR(H9,H10),100%,50%)","v":1},"SECONDE"]
[]
[]
[]
["E1","DICHIARAZIONI",null,{"$f":"\"RICHIESTA DI CONTRIBUTO PER \"&RICHIESTA!F22&\" di \"&RICHIESTA!F20&\" CON RIFERIMENTO ALLA ORDINANZA COMMISSARIALE \"&IF(RICHIESTA!E23=\"L0\",\"N.4/2016\",IF(RICHIESTA!D20=\"P\",\"N.13/2017\",\"N.19/2017\"))","v":"RICHIESTA DI CONTRIBUTO PER RIPARAZIONE CON RAFFORZAMENTO LOCALE di EDIFICIO AD USO ABITATIVO CON RIFERIMENTO ALLA ORDINANZA COMMISSARIALE N.4/2016"}]
[null,"Titolo Richiesta"]
[null,null,"Tipo proprietà richiedente",null,"Privata"]
[null,null,"Legittimazione",{"$f":"INDEX(LookupTable!P2:P6,MATCH(E17,LookupTable!Q2:Q6,0))","v":1},"Persona fisica"]
[null,null,"Condominio registrato o di fatto",null,{"$f":"IF(OR(D17=3,D17=4),\"S\",\"N\")","v":"N"}]
[null,null,"IVA strutture detraibile",null,{"$f":"IF(D17=5,\"S\",\"N\")","v":"N"},{"$f":"IF(E19=\"N\",0%,100%)","v":0},"IVA detratta (pro-rata)"]
[null,null,"Destinazione d'uso prevalente",{"$f":"VLOOKUP($E20,LookupTable!$AL2:$AN5,2,FALSE)","v":"A"},"Abitativa",{"$f":"VLOOKUP($E20,LookupTable!$AL2:$AN5,3,FALSE)","v":"EDIFICIO AD USO ABITATIVO"}]
[]
[null,"Intervento","Tipologia intervento",{"$f":"VLOOKUP($E22,LookupTable!$V2:$X7,2,FALSE)","v":"R"},"Rafforzamento",{"$f":"IF(AND(E23<>\"L0\",E23<>\"L4\",E24=\"S\"),\"demolizione volontaria\",VLOOKUP($E22,LookupTable!$V2:$X7,3,FALSE))","v":"RIPARAZIONE CON RAFFORZAMENTO LOCALE"},{"$f":"IF(E22=\"Rafforzamento\",50%,\nIF(D20=\"P\",-1%,\nIF(E22=\"Ricostruzione\",25%,IF(OR(E22=\"Miglioram\",E22=\"Adeguamento\"),IF(E51=\"N\",45%,40%),-1%))))","v":0.5},"Percentuale minima strutture"]
[null,null,"Livello operativo",null,"L0"]
[null,null,"Demolizione e ricostruzione",null,{"$f":"IF(OR(D22=\"DR\"),\"S\",\"N\")","v":"N"},{"$f":"IF(AND(E23=\"L4\",E24=\"S\"),\"Consigliata\",IF(E23=\"L0\",\"Non ammessa\",IF(AND(E23<>\"L4\",E24=\"S\"),\"Volontaria\",\"Non presente\")))","v":"Non ammessa"}]
[null,null,"Delocalizzazione in altro sedime",null,"N",{"$f":"IF(AND(E23=\"L4\",E24=\"S\"),\"Ammessa\",\"Vietata\")","v":"Vietata"}]
[]
[]
[]
[]
[]
{"$rows_left_out":212}
{"sheet":"CONTRIBUTO","index":1,"n_rows":280,"n_cols":25,"rows_kept":280,"cut":false,"hidden":false,"merged":[[24,1,24,8],[131,1,131,8],[176,1,176,6]]}
[{"$f":"RICHIESTA!E18","v":"N"}]
[]
[]
[]
[]
[]
[]
[]
[]
[]
[]
[]
[]
[]
[]
[]
[]
[]
[]
[]
[]
[]
[]
[]
[null,"TABELLA A"]
[null,"ALLOCAZIONE DEL CONTRIBUTO PER BENEFICIARIO",null,null,null,null,null,null,null,null,null,null,null,null,"REALE",null,null,null,null,"ARROTONDATO"]
[null,"UNITA IMMOBILIARE",null,"UI%","US%","COSTO INTERVENTO","ASSICURAZIONE","ACCOLLO","CONTRIBUTO","TIPO",null,null,null,null,"COSTO","ASSICURAZIONE","ACCOLLO","CONTRIBUTO",null,"COSTO","ASSICURAZIONE","ACCOLLO","CONTRIBUTO"]
["PC","PARTI COMUNI",null,1,1,{"$f":"T28","v":0},0,0,{"$f":"W28+IF($A1=\"N\",0,I172-W129)","v":0},null,null,null,null,null,{"$f":"IF($A1=\"N\",0,RICHIESTA!$O$128-RICHIESTA!$O$109)","v":0},{"$f":"IF($A1=\"N\",0,RICHIESTA!AZ$140)","v":0},{"$f":"O28-R28-P28","v":0},{"$f":"IF($A1=\"N\",0,RICHIESTA!$AB$128-RICHIESTA!$AB$109)","v":0},null,{"$f":"ROUND(O28,2)","v":0},{"$f":"ROUND(P28,2)","v":0},{"$f":"T28-W28-U28","v":0},{"$f":"ROUND(R28,2)","v":0}]
[{"$f":"RICHIESTA!C142","v":1},{"$f":"\"UNITA IMMOBILIARE \"&A29","v":"UNITA IMMOBILIARE 1"},null,1,{"$f":"INDEX(RICHIESTA!$X$142:$X$241,MATCH(A29,RICHIESTA!$C$142:$C$241,0))","v":1E-13},0,0,0,{"$f":"W29","v":0},{"$f":"INDEX(RICHIESTA!$I$142:$I$241,MATCH(A29,RICHIESTA!$C$142:$C$241,0))","v":"Privata"},null,null,null,null,{"$f":"$D29*(INDEX(RICHIESTA!$BG$142:$BG$241,MATCH($A29,RICHIESTA!$C$142:$C$241,0))\n+$E29*IF($A$1=\"N\",RICHIESTA!$O$128-RICHIESTA!$O$109,0))","v":1.1000000000000001E-23},{"$f":"$D29*(INDEX(RICHIESTA!$BA$142:$BA$241,MATCH($A29,RICHIESTA!$C$142:$C$241,0))\n+IF($A$1=\"N\",INDEX(RICHIESTA!$AU$142:$AU$241,MATCH($A29,RICHIESTA!$C$142:$C$241,0))/MAX(RICHIESTA!$AU$140,10^-9)*(RICHIESTA!$AC$128-RICHIESTA!$AC$109),0))","v":0},{"$f":"O29-R29-P29","v":0},{"$f":"$D29*(INDEX(RICHIESTA!$BC$142:$BC$241,MATCH($A29,RICHIESTA!$C$142:$C$241,0))\n+IF($A$1=\"N\",INDEX(RICHIESTA!$BB$142:$BB$241,MATCH($A29,RICHIESTA!$C$142:$C$241,0)),0))","v":1.1000000000000001E-23},null,{"$f":"ROUND(O29,2)","v":0},{"$f":"ROUND(P29,2)","v":0},{"$f":"T29-W29-U29","v":0},{"$f":"ROUND(R29,2)","v":0}]
[{"$f":"RICHIESTA!C143","v":2},{"$f":"\"UNITA IMMOBILIARE \"&A30","v":"UNITA IMMOBILIARE 2"},null,1,{"$f":"INDEX(RICHIESTA!$X$142:$X$241,MATCH(A30,RICHIESTA!$C$142:$C$241,0))","v":0},{"$f":"T30","v":0},{"$f":"U30","v":0},{"$f":"V30","v":0},{"$f":"W30","v":0},{"$f":"INDEX(RICHIESTA!$I$142:$I$241,MATCH(A30,RICHIESTA!$C$142:$C$241,0))","v":"Privata"},null,null,null,null,{"$f":"$D30*(INDEX(RICHIESTA!$BG$142:$BG$241,MATCH($A30,RICHIESTA!$C$142:$C$241,0))\n+$E30*IF($A$1=\"N\",RICHIESTA!$O$128-RICHIESTA!$O$109,0))","v":0},{"$f":"$D30*(INDEX(RICHIESTA!$BA$142:$BA$241,MATCH($A30,RICHIESTA!$C$142:$C$241,0))\n+IF($A$1=\"N\",INDEX(RICHIESTA!$AU$142:$AU$241,MATCH($A30,RICHIESTA!$C$142:$C$241,0))/MAX(RICHIESTA!$AU$140,10^-9)*(RICHIESTA!$AC$128-RICHIESTA!$AC$109),0))","v":0},{"$f":"O30-R30-P30","v":0},{"$f":"$D30*(INDEX(RICHIESTA!$BC$142:$BC$241,MATCH($A30,RICHIESTA!$C$142:$C$241,0))\n+IF($A$1=\"N\",INDEX(RICHIESTA!$BB$142:$BB$241,MATCH($A30,RICHIESTA!$C$142:$C$241,0)),0))","v":0},null,{"$f":"ROUND(O30,2)","v":0},{"$f":"ROUND(P30,2)","v":0},{"$f":"T30-W30-U30","v":0},{"$f":"ROUND(R30,2)","v":0}]
{"$rows_left_out":251}
{"sheet":"CostoParametrico","index":2,"n_rows":167,"n_cols":13,"rows_kept":167,"cut":false,"hidden":true,"merged":[]}
["Costo parametrico"]
[null,"Destinazione","Livello","IdParametrico","Gradino1","Gradino2","Gradino3","Gradino4","Costo1","Costo2","Costo3","Costo4"]
[null,"Demolizione",null,{"$f":"B3","v":"Demolizione"},1000000000,1000000000,1000000000,1000000000,80,80,80,80]
[null,"Produttiva","L0",{"$f":"B4&\"-\"&C4","v":"Produttiva-L0"},1000,2000,5000,1000000000,100,80,70,60]
[null,"Produttiva","L1",{"$f":"B5&\"-\"&C5","v":"Produttiva-L1"},1000,2000,5000,1000000000,300,270,250,230]
[null,"Produttiva","L2","Produttiva-L2",1000,2000,5000,1000000000,350,320,300,280]
[null,"Produttiva","L3","Produttiva-L3",1000,2000,5000,1000000000,420,390,340,305]
[null,"Produttiva","L4",{"$f":"B8&\"-\"&C8","v":"Produttiva-L4"},1000,2000,5000,1000000000,530,500,450,410]
[null,"Abitativa","L0",{"$f":"B9&\"-\"&C9","v":"Abitativa-L0"},130,220,1000000000,1000000000,400,330,300,300]
[null,"Abitativa","L1","Abitativa-L1",130,220,1000000000,1000000000,850,750,650,650]
[null,"Abitativa","L2","Abitativa-L2",130,220,1000000000,1000000000,1100,900,800,800]
[null,"Abitativa","L3","Abitativa-L3",130,220,1000000000,1000000000,1250,1100,950,950]
[null,"Abitativa","L4","Abitativa-L4",130,220,1000000000,1000000000,1450,1250,1100,1100]
[null,"Ricettiva","L0","Ricettiva-L0",1000000000,1000000000,1000000000,1000000000,400,400,400,400]
[null,"Ricettiva","L1","Ricettiva-L1",1000000000,1000000000,1000000000,1000000000,850,850,850,850]
[null,"Ricettiva","L2","Ricettiva-L2",1000000000,1000000000,1000000000,1000000000,1100,1100,1100,1100]
[null,"Ricettiva","L3","Ricettiva-L3",1000000000,1000000000,1000000000,1000000000,1250,1250,1250,1250]
[null,"Ricettiva","L4","Ricettiva-L4",1000000000,1000000000,1000000000,1000000000,1450,1450,1450,1450]
[]
["Instabilità dinamica"]
[null,"Destinazione","Livello","Ricostruzione","IdParametrico","Gradino1","Gradino2","Gradino3","Gradino4","M1","M2","M3","M4"]
[null,"Produttiva","L0","N",{"$f":"B22&\"-\"&C22&\"-\"&D22","v":"Produttiva-L0-N"},0,0.25,0.35,0.45,0,0,0,0]
[null,"Produttiva","L1","N",{"$f":"B23&\"-\"&C23&\"-\"&D23","v":"Produttiva-L1-N"},0,0.25,0.35,0.45,0,0.05,0.1,0.15]
[null,"Produttiva","L2","N","Produttiva-L2-N",0,0.25,0.35,0.45,0,0.05,0.1,0.15]
[null,"Produttiva","L3","N","Produttiva-L3-N",0,0.25,0.35,0.45,0,0.05,0.1,0.15]
[null,"Produttiva","L4","N",{"$f":"B26&\"-\"&C26&\"-\"&D26","v":"Produttiva-L4-N"},0,0.25,0.35,0.45,0,0.05,0.1,0.15]
[null,"Abitativa","L0","N",{"$f":"B27&\"-\"&C27&\"-\"&D27","v":"Abitativa-L0-N"},0,0.25,0.35,0.45,0,0,0,0]
[null,"Abitativa","L1","N","Abitativa-L1-N",0,0.25,0.35,0.45,0,0.05,0.1,0.15]
[null,"Abitativa","L2","N","Abitativa-L2-N",0,0.25,0.35,0.45,0,0.05,0.1,0.15]
[null,"Abitativa","L3","N","Abitativa-L3-N",0,0.25,0.35,0.45,0,0.05,0.1,0.15]
{"$rows_left_out":138}
{"sheet":"LookupTable","index":3,"n_rows":1008,"n_cols":50,"rows_kept":1008,"cut":false,"hidden":true,"merged":[]}
["Denominazione in italiano","Provincia","Regione","Cratere","MUDE","Regione","Città Metropolitana","Provincia (1)","Progressivo del Comune (2)","Comune",null,"SI-NO",null,"TipoPersona",null,"ID","Tipo proprietario strutture","Richiedente","PartiComuni",null,"IDIntervento","Intervento","CodInt","Intervento","SAL-INIZ","SAL-INT1","SAL-INT2","SAL-FINE",null,null,"ID","Proprieta",null,"IdLivelloOperativo","Livello operativo",null,"ID","Destinazione prevalente","nome","Struttura",null,"ID","Aggregato",null,"ID","Descrizione","Combinato","Residenziale",null,"VERO-FALSO"]
["Abbateggio","PE","Abruzzo",false,true,13,"-","068","001","068001",null,"S",null,"PF","F",1,"Persona fisica",1,"N",null,25,"Rafforzamento","R","RIPARAZIONE CON RAFFORZAMENTO LOCALE",0.5,0,0,0.5,null,null,0,"Privata",null,6,"L0",null,1,"Abitativa","A","EDIFICIO AD USO ABITATIVO",null,0,"NO",null,"A","Abitativo","A - Abitativo",1,null,true]
["Acciano","AQ","Abruzzo",false,false,13,"-","066","001","066001",null,"N",null,"RS","G",2,"Comunione",1,"N",null,26,"Miglioram","M","RIPARAZIONE CON MIGLIORAMENTO SISMICO",0.2,0.2,0.3,0.3,null,null,1,"Pubblica",null,7,"L1",null,102,"Ricettiva","R","EDIFICIO AD USO NON ABITATIVO",null,1,"Volontario",null,"B","Agricolo","B - Agricolo",0.7,null,false]
["Accumoli","RI","Lazio",true,true,12,"-","057","001","057001",null,null,null,null,null,3,"Condominio di fatto",1,"S",null,27,"Adeguamento","A","RIPARAZIONE CON ADEGUAMENTO SISMICO",0.2,0.2,0.3,0.3,null,null,2,"ONLUS",null,8,"L2",null,3,"Produttiva","P","EDIFICIO AD USO NON ABITATIVO",null,2,"UMI",null,"C","Commercio","C - Commercio",0.7]
["Acquacanina","MC","Marche",true,false,11,"-","043","001","043001",null,null,null,null,null,4,"Condominio registrato",13,"S",null,28,"Ricostruzione","DR","DEMOLIZIONE E RICOSTRUZIONE",0.2,0.2,0.3,0.3,null,null,null,null,null,9,"L3",null,103,"Beni e Scorte","B","BENI E SCORTE",null,null,null,null,"D","Direzionale / Uffici","D - Direzionale / Uffici",0.7]
["Acquafondata","FR","Lazio",false,false,12,"-","060","001","060001",null,null,null,null,null,5,"Persona giuridica",13,"N",null,29,"Acquisto","C","ACQUISTO DI NUOVO IMMOBILE SOSTITUTIVO",0,0,0,1,null,null,null,null,null,10,"L4",null,null,null,null,null,null,null,null,null,"E","Industriale / Artigianale","E - Industriale / Artigianale",0.7]
["Acqualagna","PU","Marche",false,false,11,"-","041","001","041001",null,null,null,null,null,null,null,null,null,null,30,"Demolizione","DC","DEMOLIZIONE",0,0,0,1,null,null,null,null,null,null,null,null,null,null,null,null,null,null,null,null,"F","Servizi Pubblici","F - Servizi Pubblici",0.7]
["Acquapendente","VT","Lazio",false,false,12,"-","056","001","056001",null,null,null,null,null,null,null,null,null,null,null,null,null,null,null,null,null,null,null,null,null,null,null,null,null,null,null,null,null,null,null,null,null,null,"G","Turistico / Ricettivo","G - Turistico / Ricettivo",0.7]
["Acquasanta Terme","AP","Marche",true,true,11,"-","044","001","044001",null,null,null,null,null,null,null,null,null,null,null,null,null,null,null,null,null,null,null,null,null,null,null,null,null,null,null,null,null,null,null,null,null,null,"H","Altro","H - Altro",0.7]
["Acquasparta","TR","Umbria",false,true,10,"-","055","001","055001"]
["Acquaviva Picena","AP","Marche",false,true,11,"-","044","002","044002",null,null,null,null,null,null,null,null,null,null,null,"Rafforzamento","Miglioram","Adeguamento","Ricostruzione","Acquisto","Demolizione"]
["Acuto","FR","Lazio",false,false,12,"-","060","002","060002",null,null,null,null,null,null,null,null,null,null,null,"L0","L1","L4","L1","L4","L4"]
["Affile","RM","Lazio",false,false,12,"258","058","001","058001",null,null,null,null,null,null,null,null,null,null,null,null,"L2",null,"L2"]
["Agosta","RM","Lazio",false,false,12,"258","058","002","058002",null,null,null,null,null,null,null,null,null,null,null,null,"L3",null,"L3"]
["Agugliano","AN","Marche",false,false,11,"-","042","001","042001",null,null,null,null,null,null,null,null,null,null,null,null,null,null,"L4"]
["Aielli","AQ","Abruzzo",false,false,13,"-","066","002","066002"]
["Alanno","PE","Abruzzo",false,true,13,"-","068","002","068002"]
["Alatri","FR","Lazio",false,false,12,"-","060","003","060003",null,null,null,null,null,null,null,null,null,null,null,"Ammessa","Vietata"]
["Alba Adriatica","TE","Abruzzo",false,false,13,"-","067","001","067001",null,null,null,null,null,null,null,null,null,null,null,"S","N"]
["Albano Laziale","RM","Lazio",false,false,12,"258","058","003","058003",null,null,null,null,null,null,null,null,null,null,null,"N"]
["Alfedena","AQ","Abruzzo",false,false,13,"-","066","003","066003"]
["Allerona","TR","Umbria",false,false,10,"-","055","002","055002"]
["Allumiere","RM","Lazio",false,false,12,"258","058","004","058004"]
["Altidona","FM","Marche",false,true,11,"-","109","001","109001"]
["Altino","CH","Abruzzo",false,false,13,"-","069","001","069001"]
["Alviano","TR","Umbria",false,true,10,"-","055","003","055003"]
["Alvito","FR","Lazio",false,false,12,"-","060","004","060004"]
["Amandola","FM","Marche",true,true,11,"-","109","002","109002"]
["Amaseno","FR","Lazio",false,false,12,"-","060","005","060005"]
["Amatrice","RI","Lazio",true,true,12,"-","057","002","057002"]
{"$rows_left_out":979}
{"sheet":"SpeseTecniche","index":4,"n_rows":64,"n_cols":29,"rows_kept":64,"cut":false,"hidden":true,"merged":[[22,11,22,13],[43,4,43,7],[22,4,22,7],[29,4,29,7],[2,4,2,7],[8,4,8,7],[15,4,15,8],[32,11,32,14]]}
[null,null,{"$f":"RICHIESTA!D22","v":"R"},{"$f":"RICHIESTA!E20","v":"Abitativa"},null,null,null,null,{"$f":"IF(RICHIESTA!D22=\"DC\",0,6000)","v":6000},null,{"$f":"RICHIESTA!$T$103","v":0}]
[null,null,null,null,null,null,null,null,null,null,{"$f":"IF($D$1=\"Produttiva\",$D$12,$D$19)","v":6000}]
[null,null,null,null,"Indagini e prove (art. 7 c. 6)",null,null,null,null,"Perc. Ordinanza","Perc. Richiesta","RICHIESTA",null,null,null,null,null,null,null,null,null,null,null,null,null,null,null,null,"S"]
[null,null,null,"Lavori ammessi",500000,1000000,2000000,"-","Progettazione",0.54,{"$f":"J4+IF(K5>0,0,5%)","v":0.59000000000000008},{"$f":"K$2*K4","v":3540.0000000000005},null,null,null,null,null,null,null,null,null,null,null,null,null,null,null,null,"N"]
[null,null,null,"Percentuale",0.03,1.4999999999999999E-2,7.4999999999999997E-3,3.5000000000000001E-3,"Coord. sicurezza",0.09,{"$f":"IF(SUM(RICHIESTA!M$119:M$120)=0,0,J5)","v":0},{"$f":"K$2*K5","v":0}]
[null,"RICHIESTA",{"$f":"SUM(RICHIESTA!R$106:R$110)","v":1E-10},{"$f":"SUM(E6:H6)","v":3.0000000000000001E-12},{"$f":"MIN(E4,$C6)*E5","v":3.0000000000000001E-12},{"$f":"MAX(0,(MIN($C6,F4)-E4))*F5","v":0},{"$f":"MAX(0,MIN($C6,G4)-F4)*G5","v":0},{"$f":"MAX(0,$C6-G4)*H5","v":0},"Direzione lavori",0.33,{"$f":"J6+IF(K7>0,0,4%)+IF(K5>0,0,4%)","v":0.41},{"$f":"K$2*K6","v":2460}]
[null,null,null,null,null,null,null,null,"Collaudo",0.04,{"$f":"IF(SUM(RICHIESTA!M$123:M$124)=0,0,J7)","v":0},{"$f":"K$2*K7","v":0}]
[null,null,null,null,null,null,null,null,null,{"$f":"SUM(J4:J7)","v":1},{"$f":"SUM(K4:K7)","v":1},{"$f":"SUM(L4:L7)","v":6000}]
[null,null,null,null,"Spese tecniche edifici produttivi (art. 8 c. 3)"]
[null,null,null,"Lavori ammessi",500000,1000000,2000000,"-"]
[null,null,null,"Percentuale",0.115,0.09,0.08,7.0000000000000007E-2]
[null,"RICHIESTA",{"$f":"SUM(RICHIESTA!$R$105:$R$110)","v":1E-10},{"$f":"MAX(I12,SUM(E12:H12))","v":1.1500000000000001E-11},{"$f":"MIN(E$10,$C12)*E$11","v":1.1500000000000001E-11},{"$f":"MAX(0,(MIN($C12,F$10)-E$10))*F$11","v":0},{"$f":"MAX(0,MIN($C12,G$10)-F$10)*G$11","v":0},{"$f":"MAX(0,$C12-G$10)*H$11","v":0},0]
[]
[]
[]
[null,null,null,null,"Spese tecniche edifici residenziali (art. 8 c. 4)"]
[null,null,null,"Lavori ammessi",150000,500000,1000000,2000000,"-"]
[null,null,null,"Percentuale",0.125,0.12,0.1,8.5000000000000006E-2,7.4999999999999997E-2]
[null,"RICHIESTA",{"$f":"C12","v":1E-10},{"$f":"MAX(J19,SUM(E19:I19))","v":6000},{"$f":"MIN(E$17,$C19)*E$18","v":1.25E-11},{"$f":"MAX(0,(MIN($C19,F17)-E17))*F18","v":0},{"$f":"MAX(0,MIN($C19,G17)-F17)*G18","v":0},{"$f":"MAX(0,MIN($C19,H17)-G17)*H18","v":0},{"$f":"MAX(0,$C19-H17)*I18","v":0},{"$f":"IF(C19=0,0,$I$1)","v":6000}]
[]
[]
[]
[null,null,null,null,"Relazione geologica (art. 9 c. 1.a)",null,null,null,null,null,null,"Compilazione AeDES (allegato D residenziale)"]
[null,null,null,"Lavori ammessi",500000,1000000,2000000,"-",null,null,null,"#UI","Isolato","Centro storico"]
[null,null,null,"Percentuale",1.4E-2,0.01,7.0000000000000001E-3,5.0000000000000001E-3,null,null,null,0,0,0]
[{"$f":"RICHIESTA!E135","v":"N"},"RICHIESTA",{"$f":"C19","v":1E-10},{"$f":"H35*$E$32","v":0},{"$f":"MIN(E$24,$C26)*E$25","v":1.4000000000000001E-12},{"$f":"MAX(0,(MIN($C26,F$24)-E$24))*F$25","v":0},{"$f":"MAX(0,MIN($C26,G$24)-F$24)*G$25","v":0},{"$f":"MAX(0,$C26-G$24)*H$25","v":0},1000,null,null,0.1,470,560]
[null,null,null,null,null,null,null,null,null,null,null,2.1,550,660]
[null,null,null,null,null,null,null,null,null,null,null,5.0999999999999996,680,800]
[null,null,null,null,null,null,null,null,null,null,"Edificio contiguo",10.1,820,1000]
[null,null,null,null,"Altre prestazioni specialistiche (art. 9 c. 1.b)",null,null,null,null,{"$f":"IF(K30=\"N\",M30,N30)","v":560},{"$f":"RICHIESTA!H10","v":false},{"$f":"COUNTIF(RICHIESTA!$X$142:$X$241,\">0\")","v":1},{"$f":"INDEX(M$25:M$29,MATCH($L$30,$L$25:$L$29,1))","v":470},{"$f":"INDEX(N$25:N$29,MATCH($L$30,$L$25:$L$29,1))","v":560}]
{"$rows_left_out":35}
{"sheet":"Versioni","index":5,"n_rows":69,"n_cols":3,"rows_kept":69,"cut":false,"hidden":false,"merged":[]}
["VER","DATA","NOTE"]
[{"$f":"B2","v":"2017-10-19"},"2017-10-19","versione iniziale di sviluppo"]
[{"$f":"B3","v":"2017-11-09"},"2017-11-09","inserito controllo di assicurazione sulle parti comuni \"non negativa\""]
[null,null,"ripartizione spese tecniche spostata su valori ante oneri di cassa"]
[null,null,"forzato ulteriori prestazioni specialistiche a €1000 in caso di valore inferiore al 2% del costo dell'intervento"]
[null,null,"riduzione del 30% per magazzino non applicata in caso di OCSR 13"]
[null,null,"corretta la formula di calcolo degli accolli in caso di anticipi con IVA detraibile"]
[null,null,"corretto calcolo accollo in caso di assicurazione ed assenza di finiture interne"]
[null,null,"inserita maggiorazione Classo II edificio misto pubblico-privato"]
[null,null,"corretto riferimento per incremento 80% convenzionale in caso di abitazione dentro produttivo"]
[null,null,"modificate le maggiorazioni per ca in opera e muratura ex OCSR 41/17"]
[null,null,"inserita gestione IVA pro-rata ex art. 19-bis DPR 633/72"]
[{"$f":"B13","v":"2017-11-14"},"2017-11-14","rimossa maggiorazione rimozione macerie per demolizioni volontarie"]
[null,null,"formula RESTITUIRE per finiture interne ora gestisce meglio condomini misti abitazione-produttivi"]
[{"$f":"B15","v":"2017-11-24"},"2017-11-24","corretta formula contributo per immobile assicurato in decurtazione diretta"]
["2017-12-01","2017-12-01","separate indagini e prove dal resto dei lavori"]
["2017-12-22","2017-12-22","correzione formula di calcolo contributo immobile assicurato RICHIESTA colonna W e AA poi AT AU e AV"]
[null,null,"correzione formula massimo compilazione AeDES RICHIESTA R113"]
[null,null,"correzione conteggio UI principali in edificio RICHIESTA D140"]
[{"$f":"B20","v":"2018-01-12"},"2018-01-12","adeguamento calcolo contributo compilazione AeDES produttivi"]
[null,null,"correzione importo lavori ai fini del calcolo delle indagini e prove"]
[null,null,"specificato il numero di US aggregate volontariamente rispetto alle UMI"]
[{"$f":"B23","v":"2018-01-19"},"2018-01-19","correzione oneri di cassa su tabella riassuntiva"]
[null,null,"correzione formula maggiorazione risparmio energetico"]
[null,null,"correzione maggiorazione per cantieri in quota per edifici riconducibili ad abitativi"]
[null,null,"recepito modifiche alla maggiorazione per vincoli art. 136 ordinanza 8 in seguito alla ordinanza 46"]
[null,null,"correzione formula IVA pro-rata ex art. 19-bis DPR 633/1972"]
[{"$f":"B28","v":"2018-01-26"},"2018-01-26","inserimento formula IVA detraibile al 100% in caso di assenza di pro-rata"]
[null,null,"contributo IVA inclusa colonna AX valutato sul pro-rata"]
[null,null,"correzione alla formula di determinazione UI seconda abitazione"]
{"$rows_left_out":39}