{"text_format":"1","workbook":"xlsx","n_sheets":6,"sheets":["RICHIESTA","CONTRIBUTO","CostoParametrico","LookupTable","SpeseTecniche","Versioni"],"not_rendered":{"charts":0,"images":0,"macros":1,"external_links":1,"defined_names":39,"comments":1,"pivot_tables":0},"unopened":[],"bounds":{"document_bytes":16777216,"sheet_cells":100000,"rows_first":2000,"rows_last":500,"rows_between":2000,"halvings":0,"cell_chars":16384,"cell_head_chars":4096},"cells_cut":0,"cells_raw":0,"read":"whole","date_system":"1900"}

{"sheet":"RICHIESTA","index":0,"n_rows":241,"n_cols":63,"rows_kept":241,"cut":false,"hidden":false,"merged":[[139,25,139,28],[139,29,139,32]]}
[]
[null,null,null,null,null,null,null,null,null,null,null,"S"]
[null,null,null,null,null,null,null,null,null,null,null,"N"]
[]
[]
["A","LOCALIZZAZIONE"]
[]
[null,"REGIONE",{"$f":"VLOOKUP(C9,LookupTable!A:J,3,FALSE)","v":"Lazio"},null,{"$f":"VLOOKUP(C9,LookupTable!A:J,6,FALSE)","v":12},null,null,null,"COMUNI","INTERNE"]
[null,"COMUNE","Accumoli",{"$f":"VLOOKUP(C9,LookupTable!A:J,2,FALSE)","v":"RI"},{"$f":"VLOOKUP(C9,LookupTable!A:J,10,FALSE)","v":"057001"},null,"CRATERE",{"$f":"VLOOKUP(C9,LookupTable!A:J,4,FALSE)","v":true},1,1,"PRIME"]
[null,"CENTRO STORICO",false,null,null,null,"CENTRO STORICO-BORGO TIPICO",{"$f":"C10","v":false},{"$f":"IF(OR(H9,H10,E140),100%,50%)","v":1},{"$f":"IF(OR(H9,H10),100%,50%)","v":1},"SECONDE"]
[]
[]
[]
["E1","DICHIARAZIONI",null,{"$f":"\"RICHIESTA DI CONTRIBUTO PER \"&RICHIESTA!F22&\" di \"&RICHIESTA!F20&\" CON RIFERIMENTO ALLA ORDINANZA COMMISSARIALE \"&IF(RICHIESTA!E23=\"L0\",\"N.4/2016\",IF(RICHIESTA!D20=\"P\",\"N.13/2017\",\"N.19/2017\"))","v":"RICHIESTA DI CONTRIBUTO PER RIPARAZIONE CON RAFFORZAMENTO LOCALE di EDIFICIO AD USO ABITATIVO CON RIFERIMENTO ALLA ORDINANZA COMMISSARIALE N.4/2016"}]
[null,"Titolo Richiesta"]
[null,null,"Tipo proprietà richiedente",null,"Privata"]
[null,null,"Legittimazione",{"$f":"INDEX(LookupTable!P2:P6,MATCH(E17,LookupTable!Q2:Q6,0))","v":1},"Persona fisica"]
[null,null,"Condominio registrato o di fatto",null,{"$f":"IF(OR(D17=3,D17=4),\"S\",\"N\")","v":"N"}]
[null,null,"IVA strutture detraibile",null,{"$f":"IF(D17=5,\"S\",\"N\")","v":"N"},{"$f":"IF(E19=\"N\",0%,100%)","v":0},"IVA detratta (pro-rata)"]
[null,null,"Destinazione d'uso prevalente",{"$f":"VLOOKUP($E20,LookupTable!$AL2:$AN5,2,FALSE)","v":"A"},"Abitativa",{"$f":"VLOOKUP($E20,LookupTable!$AL2:$AN5,3,FALSE)","v":"EDIFICIO AD USO ABITATIVO"}]
[]
[null,"Intervento","Tipologia intervento",{"$f":"VLOOKUP($E22,LookupTable!$V2:$X7,2,FALSE)","v":"R"},"Rafforzamento",{"$f":"IF(AND(E23<>\"L0\",E23<>\"L4\",E24=\"S\"),\"demolizione volontaria\",VLOOKUP($E22,LookupTable!$V2:$X7,3,FALSE))","v":"RIPARAZIONE CON RAFFORZAMENTO LOCALE"},{"$f":"IF(E22=\"Rafforzamento\",50%,\nIF(D20=\"P\",-1%,\nIF(E22=\"Ricostruzione\",25%,IF(OR(E22=\"Miglioram\",E22=\"Adeguamento\"),IF(E51=\"N\",45%,40%),-1%))))","v":0.5},"Percentuale minima strutture"]
[null,null,"Livello operativo",null,"L0"]
[null,null,"Demolizione e ricostruzione",null,{"$f":"IF(OR(D22=\"DR\"),\"S\",\"N\")","v":"N"},{"$f":"IF(AND(E23=\"L4\",E24=\"S\"),\"Consigliata\",IF(E23=\"L0\",\"Non ammessa\",IF(AND(E23<>\"L4\",E24=\"S\"),\"Volontaria\",\"Non presente\")))","v":"Non ammessa"}]
[null,null,"Delocalizzazione in altro sedime",null,"N",{"$f":"IF(AND(E23=\"L4\",E24=\"S\"),\"Ammessa\",\"Vietata\")","v":"Vietata"}]
[]
[]
[]
[]
[]
[]
[]
[]
[]
[]
[]
[]
[]
[]
[]
[]
[]
[]
[]
[]
["C","DATI GENERALI"]
[null,null,null,null,null,null,"MAGAZZINO","ABITAZIONE/ATTIVITA"]
[null,null,"Riduzioni per magazzino o pertinenza esterna",null,null,-0.3,{"$f":"F48","v":-0.3}]
[]
[null,"Vincoli",null,{"$f":"SUM(D51:D58)","v":0},{"$f":"IF(D50=0,\"N\",\"S\")","v":"N"},{"$f":"IF(OR(D23=\"DC\",E50=\"N\"),0,MAX(F51:F58))","v":0},{"$f":"$F50","v":0},{"$f":"$F50","v":0}]
[null,null,"Parte II del Dlgs 42/2004 (Bene culturale)",{"$f":"IF(E51=\"S\",1,0)","v":0},"N",{"$f":"IF(E51=\"S\",CostoParametrico!F$149,0)","v":0}]
[null,null,"art. 136 del Dlgs 42/2004 (Notevole interesse pubblico)",0,"N",{"$f":"IF(E52=\"S\",CostoParametrico!G$149,0)","v":0}]
[null,null,"art. 142 del Dlgs 42/2004 (In aree di interesse paesaggistico)",0,"N",{"$f":"IF(E53=\"S\",CostoParametrico!H$149,0)","v":0}]
[null,null,"art. 45 Dlgs 42/2004",0,"N",{"$f":"IF(E54=\"S\",CostoParametrico!I$149,0)","v":0}]
[null,null,"Prescrizione Tutela Indiretta",0,"N",0]
[null,null,"Interesse storico",0,"N",0]
[null,null,"Pregio",0,"N",0]
[null,null,"Normativa regionale di settore",0,"N",0]
[]
[null,null,"TOTALE MAGGIORAZIONI",null,null,null,{"$f":"IF(D23=\"DC\",0,SUM(G61:G102))","v":0},{"$f":"IF(D23=\"DC\",0,SUM(H61:H102))","v":0}]
[]
[null,null,"Ricostruzione con riduzione della superficie > 50%",null,"N",{"$f":"IF(AND(E24=\"S\",E62=\"S\"),15%,0)","v":0},null,{"$f":"$F62","v":0}]
[null,null,"Ricostruzione con riduzione della superficie > 25%",null,"N",{"$f":"IF(AND(E24=\"S\",E62=\"N\",E63=\"S\"),8%,0)","v":0},null,{"$f":"$F63","v":0}]
[]
[null,null,"Aggregato - UMI",null,"N","N"]
[null,null,"Numero di US in Aggregato - UMI",{"$f":"E66-F66","v":0},0,0]
[null,null,"Aggregato coincide con Isolato",null,"N",{"$f":"IF(AND(D66>=8,E67=\"N\"),17%,IF(AND(D66>=5,E67=\"S\"),17%,IF(AND(D66>=5,E67=\"N\",D66<8),15%,IF(AND(D66>=3,D66<5),10%,0))))","v":0},null,{"$f":"$F67","v":0}]
[null,null,"Aggregato contiene edifici L0 < 50% della superficie",null,"N"]
[null,null,"Aggregato contiene edifici Agibili < 20% della superficie",null,"N"]
[null,null,"Delocalizzazione obbligatoria",null,"N",{"$f":"IF(AND(E70=\"S\",D20=\"A\"),30%,0)","v":0}]
[]
[null,"Maggiorazioni al costo convenzionale"]
[null,null,"Pericolosita sismica Ag * S",null,0,{"$f":"CostoParametrico!A52","v":0},{"$f":"$F73","v":0},0]
[null,null,"Instabilita dinamica in fase sismica per liquefazione",null,"N",{"$f":"CostoParametrico!A53","v":0},0,0]
[null,null,"Indagini Geofisiche",null,"N",{"$f":"IF(E75=\"S\",CostoParametrico!A60,0)","v":0},0,0]
[null,null,"Distanza tra edifici",null,"N",{"$f":"IF(E76=\"S\",CostoParametrico!A69,0)","v":0},0,0]
[null,null,"Smaltimento demolizioni 25% +",null,"N"]
[null,null,"Smaltimento demolizioni 50% +",null,"N",{"$f":"CostoParametrico!A77","v":0},null,{"$f":"$F78","v":0}]
[null,null,"Ricostruzione Edifici uni-bifamiliari",null,"N",{"$f":"IF(E79=\"S\",CostoParametrico!A85,0)","v":0},null,0]
[null,null,"Accessibilita Disabili",null,"N",{"$f":"IF(E80=\"S\",CostoParametrico!A106,0)","v":0},null,0]
[null,null,"Murature Spesse",null,"N",{"$f":"IF(E81=\"S\",CostoParametrico!A107,0)","v":0},{"$f":"$F81","v":0},0]
[null,null,"Altezza Sotto Travi",null,"N",{"$f":"IF(E82=\"S\",CostoParametrico!A113,0)","v":0},{"$f":"$F82","v":0},0]
[null,null,"Inteferenza lavori con l'attività di impresa",null,"N",{"$f":"IF(AND(E83=\"S\",E$23<>\"L0\",D$20=\"P\",E24=\"N\"),15%,0)","v":0},null,0]
[null,null,"Cemento armato posato in opera",null,"N",{"$f":"IF(AND(E84=\"S\",E$20=\"Produttiva\",OR(E$23=\"L1\",E$23=\"L2\",E$23=\"L3\")),10%,0)","v":0},{"$f":"$F84","v":0},0]
[null,null,"Edificio produttivo costruito in muratura",null,"N",{"$f":"IF(AND(E85=\"S\",E$20=\"Produttiva\",OR(E$23=\"L1\",E$23=\"L2\",E$23=\"L3\")),20%,0)","v":0},{"$f":"$F85","v":0},0]
[]
[null,null,"Edificio ad altitudine 700m + slm",null,"N"]
[null,null,"Edificio ad altitudine 1000m + slm",null,"N",{"$f":"CostoParametrico!A156","v":0},{"$f":"$F88","v":0},{"$f":"$F88","v":0}]
[]
[null,null,"Copertura in cemento-amianto 25%+",null,"N"]
[null,null,"Copertura in cemento-amianto 50%+",null,"N",{"$f":"CostoParametrico!A166","v":0},{"$f":"$F91","v":0},{"$f":"$F91","v":0}]
[]
[null,"Efficientamento energetico"]
[null,null,"Riduzione 30%",null,"N",{"$f":"IF(AND(E94=\"S\",E$23<>\"L0\",D19<>\"P\",OR(D22=\"M\",D22=\"A\")),10%,0)","v":0},null,{"$f":"$F94","v":0}]
[null,null,"Classe energetica A",null,"N",{"$f":"IF(AND(E95=\"S\",E$23=\"L4\",D20<>\"P\",D22=\"DR\"),10%,0)","v":0},null,{"$f":"$F95","v":0}]
[null,null,"Impianti industriali di particolare complessità",null,"N",{"$f":"IF(AND(E96=\"S\",E$23<>\"L0\",D$20=\"P\"),15%,0)","v":0},null,{"$f":"$F96","v":0}]
[]
[null,"Altre maggiorazioni"]
[null,null,"Faccia vista da trattare",null,"N",{"$f":"IF(AND(E99=\"S\",E$50=\"N\",OR(D$20=\"A\",D$20=\"R\")),IF(E$23<>\"L0\",3%,0),0)","v":0},null,{"$f":"$F99","v":0}]
[null,null,"Solai in legno",null,"N",{"$f":"IF(AND(E100=\"S\",E$50=\"N\",OR(D$20=\"A\",D$20=\"R\")),IF(E$23<>\"L0\",2%,0),0)","v":0},null,{"$f":"$F100","v":0}]
[null,null,"Infissi in legno",null,"N",{"$f":"IF(AND(E101=\"S\",E$50=\"N\",OR(D$20=\"A\",D$20=\"R\")),IF(E$23<>\"L0\",2%,0),0)","v":0},null,{"$f":"$F101","v":0},null,null,null,null,null,null,null,null,null,null,null,null,null,null,null,null,null,null,null,null,null,null,null,null,null,null,null,"AMMESSE","NON AMMESSE","AMMESSE","AMMESSE","NON AMMESSE ","TOTALE",null,null,null,"IVA SUL","CONTRIBUTO","ANTICIPO DA","ASSICURAZIONE"]
[null,null,"Misto pubblico-privato in Classe II",null,"N",{"$f":"IF(AND(E102=\"S\",E$23<>\"L0\"),3%,0)","v":0},null,{"$f":"$F102","v":0},null,null,null,null,null,null,null,"STRUTTURE MINIME",{"$f":"G22","v":0.5},{"$f":"SpeseTecniche!D6","v":3.0000000000000001E-12},"MAX",{"$f":"IF(E20=\"Produttiva\",SpeseTecniche!D12,SpeseTecniche!D19)","v":6000},null,null,null,null,null,null,null,null,null,null,null,null,null,null,"RICHIESTA","ISTRUTTORIA","ISTRUTTORIA","AL LORDO","CONVENZIONALE","CONVENZIONALE","ACCOLLO","ASSICURAZIONE","CONTRIBUTO","IVA","CONTRIBUTO","IVA INCLUSA","RESTITUIRE","IVA INCLUSA"]
[null,null,null,null,null,null,null,null,null,null,null,null,null,null,null,"STRUTTURE MISURATE",{"$f":"SUM(M105:M107)/MAX(SUM(M105:M109),1)","v":1E-10},{"$f":"Q105","v":0},"MIS",{"$f":"SUM(Q113:Q126)","v":0},null,null,null,null,null,null,null,null,null,null,null,null,null,null,"b","c","d = b-c","DI CASSA","e = min [a,c]","f = c-e","g = d+f","h","i = b-g-h","j","k=i*j","l=i+k","m","n"]
[null,"Quadro Economico",null,null,"RICHIESTA","IVA","ANTICIPO","IVA",null,null,null,"PESO","RICHIESTO","INCR-IVA","RICHIESTO-IVATO",null,"FINITURE","PROVE",null,"SPESE TECNICHE","ONERI","RID","PESO","AMMESSE","AMMESSE-IVATE","ASSICURAZIONE","CONTRIBUTO","CONTR-IVATO","ASSIC-IVATA","ACCOLLO","RESTITUIRE","PAGARE",null,"TOTALE OPERE",{"$f":"SUM(AI105:AI109)","v":1E-10},{"$f":"SUM(AJ105:AJ109)","v":1E-10},0,1E-10,{"$f":"SUM(AM105:AM109)","v":1.0000000000000002E-33},{"$f":"SUM(AN105:AN109)","v":1E-10},{"$f":"SUM(AO105:AO109)","v":1E-10},{"$f":"SUM(AP105:AP109)","v":0},{"$f":"SUM(AQ105:AQ109)","v":1.0000000000000002E-33},null,{"$f":"SUM(AS105:AS109)","v":1.0000000000000004E-34},{"$f":"SUM(AT105:AT109)","v":1.1000000000000004E-33},{"$f":"SUM(AU105:AU109)","v":0},{"$f":"SUM(AV105:AV109)","v":0},"somma 1:5"]
[null,null,"Indagini e prove",null,0,10,0,{"$f":"F105","v":10},null,null,null,{"$f":"M105/MAX(1,M$128-M$109)","v":0},{"$f":"E105","v":0},{"$f":"(1+F105/100*(1-IF($E$19=\"N\",0,$F$19)))","v":1.1000000000000001},{"$f":"M105*(1+F105/100)","v":0},null,{"$f":"M105","v":0},{"$f":"MIN(R102:R103)","v":0},null,null,null,{"$f":"X105/MAX($M105,1)","v":0},{"$f":"(X105-Z105)/MAX(1,AW$140,X$128-X$109-(Z$128-Z$109))","v":0},{"$f":"R105","v":0},{"$f":"X105*N105","v":0},{"$f":"MIN(Y105,$G$140-$BA$140-SUM(Z106:Z$108*N106:N$108))/N105","v":0},{"$f":"$W105*AW$140","v":0},{"$f":"AA105*N105","v":0},{"$f":"Z105*N105","v":0},{"$f":"(O105-AB105)-AC105","v":0},{"$f":"MAX(0,AA105-MAX(0,(M105-H105)))*(1+I105/100*(1-$F$19))","v":0},{"$f":"AB105-AE105","v":0},null,"Indagini e prove",{"$f":"E105","v":0},{"$f":"X105","v":0},{"$f":"MAX(0,AI105-AJ105)","v":0},{"$f":"X105","v":0},{"$f":"AA105+Z105","v":0},{"$f":"AL105-AM105","v":0},{"$f":"MAX(0,AI105-AM105)","v":0},{"$f":"Z105","v":0},{"$f":"AM105-AP105","v":0},{"$f":"F105/100","v":0.1},{"$f":"AQ105*AR105","v":0},{"$f":"AB105","v":0},{"$f":"AE105","v":0},{"$f":"AC105","v":0},1]
[null,null,"Pronto Intervento",null,0,10,0,{"$f":"F106","v":10},null,null,null,{"$f":"M106/MAX(1,M$128-M$109)","v":0},{"$f":"E106","v":0},{"$f":"(1+F106/100*(1-IF($E$19=\"N\",0,$F$19)))","v":1.1000000000000001},{"$f":"M106*(1+F106/100)","v":0},null,{"$f":"M106","v":0},{"$f":"Q106","v":0},null,null,null,{"$f":"X106/MAX($M106,1)","v":0},{"$f":"(X106-Z106)/MAX(1,AW$140,X$128-X$109-(Z$128-Z$109))","v":0},{"$f":"R106","v":0},{"$f":"X106*N106","v":0},{"$f":"MIN(Y106,$G$140-$BA$140-SUM(Z107:Z$108*N107:N$108))/N106","v":0},{"$f":"$W106*AW$140","v":0},{"$f":"AA106*N106","v":0},{"$f":"Z106*N106","v":0},{"$f":"(O106-AB106)-AC106","v":0},{"$f":"MAX(0,AA106-MAX(0,(M106-H106)))*(1+I106/100*(1-$F$19))","v":0},0,null,"Pronto Intervento",{"$f":"E106","v":0},{"$f":"X106","v":0},{"$f":"MAX(0,AI106-AJ106)","v":0},{"$f":"X106","v":0},0,{"$f":"AL106-AM106","v":0},0,0,{"$f":"AM106-AP106","v":0},{"$f":"F106/100","v":0.1},0,0,0,0,2]
[null,null,"Opere sulle strutture",null,1E-10,10,null,null,null,null,null,{"$f":"M107/MAX(1,M$128-M$109)","v":1E-10},1E-10,1.1000000000000001,1.1000000000000001E-10,null,{"$f":"M107","v":1E-10},{"$f":"Q107","v":1E-10},null,null,null,1E-10,1E-10,{"$f":"R107","v":1E-10},1.1000000000000001E-10,{"$f":"MIN(Y107,$G$140-$BA$140-SUM(Z$108:Z108*N108:N$108))/N107","v":0},{"$f":"$W107*AW$140","v":1.0000000000000002E-33},1.1000000000000004E-33,0,1.1000000000000001E-10,0,1.1000000000000004E-33,null,"Opere sulle strutture",1E-10,1E-10,0,1E-10,1.0000000000000002E-33,1E-10,1E-10,0,1.0000000000000002E-33,{"$f":"F107/100","v":0.1},1.0000000000000004E-34,1.1000000000000004E-33,0,0,3]
[null,null,"Finiture parti comuni",null,0,10,null,null,null,null,null,{"$f":"M108/MAX(1,M$128-M$109)","v":0},0,1.1000000000000001,0,{"$f":"M108/MAX(1,SUM(M$108:M$109))","v":0},{"$f":"IF(Q$103>Q$102,M108,SUM(Q$105:Q$107)*(1-Q$102)/Q$102*P108)","v":0},{"$f":"Q108","v":0},null,null,null,0,0,{"$f":"R108","v":0},0,{"$f":"MIN(Y108,$G$140-$BA$140)/N108","v":0},{"$f":"$W108*AW$140","v":0},0,0,0,0,0,null,"Finiture parti comuni",0,0,0,0,0,0,0,0,0,{"$f":"F108/100","v":0.1},0,0,0,0,4]
[null,null,"Finiture interne",null,{"$f":"H140","v":0},null,null,null,null,null,null,null,{"$f":"AN140","v":0},null,{"$f":"BG140","v":0},{"$f":"M109/MAX(1,SUM(M$108:M$109))","v":0},{"$f":"IF(Q$103>Q$102,M109,SUM(Q$105:Q$107)*(1-Q$102)/Q$102*P109)","v":0},{"$f":"Q109","v":0},null,null,null,0,null,{"$f":"R109","v":0},{"$f":"BI140","v":0},{"$f":"MIN(AV$140,X109)","v":0},{"$f":"AX140","v":0},{"$f":"BC140","v":0},{"$f":"BA140","v":0},{"$f":"BD140","v":0},{"$f":"MAX(0,AB109-MAX(0,\nSUM(H142:H241*(1+J142:J241/100*IF(K142:K241=\"N\",1,1-$F$19)))\n-H109*(1+I109/100*(1-$F$19))))","v":0},0,null,"Finiture interne",0,0,0,0,0,0,0,0,0,null,{"$f":"SUM(BC142:BC241*J142:J241/100)","v":0},0,0,0,5]
[null,null,"Demolizioni",null,0,10,null,null,null,null,null,{"$f":"M110/MAX(1,M$128-M$109)","v":0},0,{"$f":"(1+F110/100*(1-IF($E$19=\"N\",0,$F$19)))","v":1.1000000000000001},{"$f":"M110*(1+F110/100)","v":0},null,{"$f":"M110","v":0},{"$f":"Q110","v":0},null,null,{"$f":"M110/MAX(1,SUM(M$110:M$112))","v":0},0,{"$f":"(X110-Z110)/MAX(1,AW$140,X$128-X$109-(Z$128-Z$109))","v":0},{"$f":"MIN(M110,IF(D22=\"C\",10%,100%)*AL140)","v":0},{"$f":"X110*N110","v":0},{"$f":"MIN(Y110,$G$140-$BA$140-SUM(Z$105:Z$108*N$105:N$108))/N110","v":0},{"$f":"$W110*AW$140","v":0},{"$f":"AA110*N110","v":0},{"$f":"Z110*N110","v":0},{"$f":"(O110-AB110)-AC110","v":0},0,0,null,"Demolizioni",0,0,0,0,0,0,0,0,0,{"$f":"F110/100","v":0.1},0,0,0,0,6]
[null,null,"Acquisto Terreni",null,0,null,null,null,null,null,null,0,0,1,0,null,null,null,null,null,{"$f":"M111/MAX(1,SUM(M$110:M$112))","v":0},0,0,{"$f":"M111","v":0},0,{"$f":"MIN(Y111,$G$140-$BA$140-SUM(Z$105:Z$108*N$105:N$108)-SUM(Z$110:Z110*N$110:N110))/N111","v":0},0,0,0,0,0,0,null,"Acquisto Terreni",0,0,0,0,0,0,0,0,0,{"$f":"F111/100","v":0},0,0,0,0,7]
[null,null,"Oneri fiscali Acquisto Terreni",null,0,null,null,"ONERI DI CASSA",null,null,null,0,0,null,0,null,null,"MAX",null,null,{"$f":"M112/MAX(1,SUM(M$110:M$112))","v":0},0,0,{"$f":"M112","v":0},0,{"$f":"MIN(Y112,$G$140-$BA$140-SUM(Z$105:Z$108*N$105:N$108)-SUM(Z$110:Z111*N$110:N111))","v":0},0,0,0,0,0,0,null,"Oneri fiscali Acquisto Terreni",0,0,0,0,0,0,0,0,0,null,0,0,0,0,8]
[null,null,"Compilazione scheda AeDES",null,0,22,"Ordine",{"$f":"VLOOKUP(G113,SpeseTecniche!F$53:G$64,2,FALSE)","v":0},null,null,null,0,0,{"$f":"(1+F113/100*(1-IF($E$19=\"N\",0,$F$19)))","v":1.22},0,null,{"$f":"M113/(1+H113)","v":0},{"$f":"MIN(M113/(1+U113),SpeseTecniche!J33,SpeseTecniche!L4)","v":0},{"$f":"M113/MAX(1,SUM(M$113))","v":0},{"$f":"ROUND(S113*R$113*(1+U113),2)","v":0},{"$f":"H113","v":0},0,0,{"$f":"MIN(M113,T113)","v":0},0,{"$f":"MIN(Y113,$G$140-$BA$140-SUM(Z$105:Z$108*N$105:N$108)-SUM(Z$110:Z112*N$110:N112))/N113","v":0},0,0,0,0,0,0,null,"Compilazione scheda AeDES",{"$f":"E113/(1+U113)","v":0},{"$f":"X113/(1+U113)","v":0},{"$f":"MAX(0,AI113-AJ113)","v":0},0,0,0,{"$f":"MAX(0,J113-AM113)","v":0},0,0,{"$f":"F113/100","v":0.22},0,0,0,0,9]
[null,null,"Progetto Architettonico",null,0,22,"Ordine",{"$f":"VLOOKUP(G114,SpeseTecniche!F$53:G$64,2,FALSE)","v":0},null,null,null,0,0,1.22,0,null,{"$f":"M114/(1+H114)","v":0},{"$f":"SpeseTecniche!L$4-R113","v":3540.0000000000005},{"$f":"M114/(1+U114)/MAX(1,SUM(M$114:M$118/(1+U$114:U$118)))","v":0},{"$f":"ROUND(S114*R$114*(1+U114),2)","v":0},{"$f":"H114","v":0},0,0,0,0,{"$f":"MIN(Y114,$G$140-$BA$140-SUM(Z$105:Z$108*N$105:N$108)-SUM(Z$110:Z113*N$110:N113))/N114","v":0},0,0,0,0,0,0,null,"Progetto Architettonico",{"$f":"E114/(1+U114)","v":0},{"$f":"X114/(1+U114)","v":0},{"$f":"MAX(0,AI114-AJ114)","v":0},0,0,0,0,0,0,0.22,0,0,0,0,10]
[null,null,"Progetto Strutture",null,0,22,"Ordine",{"$f":"VLOOKUP(G115,SpeseTecniche!F$53:G$64,2,FALSE)","v":0},null,null,null,0,0,1.22,0,null,0,null,{"$f":"M115/(1+U115)/MAX(1,SUM(M$114:M$118/(1+U$114:U$118)))","v":0},{"$f":"ROUND(S115*R$114*(1+U115),2)","v":0},0,0,0,0,0,{"$f":"MIN(Y115,$G$140-$BA$140-SUM(Z$105:Z$108*N$105:N$108)-SUM(Z$110:Z114*N$110:N114))/N115","v":0},0,0,0,0,0,0,null,"Progetto Strutture",0,0,0,0,0,0,0,0,0,0.22,0,0,0,0,11]
[null,null,"Progetto impianti elettrici",null,0,22,"Ordine",{"$f":"VLOOKUP(G116,SpeseTecniche!F$53:G$64,2,FALSE)","v":0},null,null,null,0,0,1.22,0,null,0,null,{"$f":"M116/(1+U116)/MAX(1,SUM(M$114:M$118/(1+U$114:U$118)))","v":0},{"$f":"ROUND(S116*R$114*(1+U116),2)","v":0},0,0,0,0,0,{"$f":"MIN(Y116,$G$140-$BA$140-SUM(Z$105:Z$108*N$105:N$108)-SUM(Z$110:Z115*N$110:N115))/N116","v":0},0,0,0,0,0,0,null,"Progetto impianti elettrici",0,0,0,0,0,0,0,0,0,0.22,0,0,0,0,12]
[null,null,"Progetto impianti termici",null,0,22,"Ordine",{"$f":"VLOOKUP(G117,SpeseTecniche!F$53:G$64,2,FALSE)","v":0},null,null,null,0,0,1.22,0,null,0,null,{"$f":"M117/(1+U117)/MAX(1,SUM(M$114:M$118/(1+U$114:U$118)))","v":0},{"$f":"ROUND(S117*R$114*(1+U117),2)","v":0},0,0,0,0,0,{"$f":"MIN(Y117,$G$140-$BA$140-SUM(Z$105:Z$108*N$105:N$108)-SUM(Z$110:Z116*N$110:N116))/N117","v":0},0,0,0,0,0,0,null,"Progetto impianti termici",0,0,0,0,0,0,0,0,0,0.22,0,0,0,0,13]
[null,null,"Altre progettazioni",null,0,22,"Ordine",{"$f":"VLOOKUP(G118,SpeseTecniche!F$53:G$64,2,FALSE)","v":0},null,null,null,0,0,1.22,0,null,0,null,{"$f":"M118/(1+U118)/MAX(1,SUM(M$114:M$118/(1+U$114:U$118)))","v":0},{"$f":"ROUND(S118*R$114*(1+U118),2)","v":0},0,0,0,0,0,{"$f":"MIN(Y118,$G$140-$BA$140-SUM(Z$105:Z$108*N$105:N$108)-SUM(Z$110:Z117*N$110:N117))/N118","v":0},0,0,0,0,0,0,null,"Altre progettazioni",0,0,0,0,0,0,0,0,0,0.22,0,0,0,0,14]
[null,null,"Sicurezza Progettazione",null,0,22,"Ordine",{"$f":"VLOOKUP(G119,SpeseTecniche!F$53:G$64,2,FALSE)","v":0},null,null,null,0,0,1.22,0,null,0,{"$f":"SpeseTecniche!L$5","v":0},{"$f":"M119/(1+U119)/MAX(1,SUM(M$119:M$120/(1+U$119:U$120)))","v":0},{"$f":"ROUND(S119*R$119*(1+U119),2)","v":0},0,0,0,0,0,{"$f":"MIN(Y119,$G$140-$BA$140-SUM(Z$105:Z$108*N$105:N$108)-SUM(Z$110:Z118*N$110:N118))/N119","v":0},0,0,0,0,0,0,null,"Sicurezza Progettazione",0,0,0,0,0,0,0,0,0,0.22,0,0,0,0,15]
[null,null,"Sicurezza Esecuzione",null,0,22,"Ordine",{"$f":"VLOOKUP(G120,SpeseTecniche!F$53:G$64,2,FALSE)","v":0},null,null,null,0,0,1.22,0,null,0,null,{"$f":"M120/(1+U120)/MAX(1,SUM(M$119:M$120/(1+U$119:U$120)))","v":0},{"$f":"ROUND(S120*R$119*(1+U120),2)","v":0},0,0,0,0,0,{"$f":"MIN(Y120,$G$140-$BA$140-SUM(Z$105:Z$108*N$105:N$108)-SUM(Z$110:Z119*N$110:N119))/N120","v":0},0,0,0,0,0,0,null,"Sicurezza Esecuzione",0,0,0,0,0,0,0,0,0,0.22,0,0,0,0,16]
[null,null,"Direzione Lavori architettonici",null,0,22,"Ordine",{"$f":"VLOOKUP(G121,SpeseTecniche!F$53:G$64,2,FALSE)","v":0},null,null,null,0,0,1.22,0,null,0,{"$f":"SpeseTecniche!L$6","v":2460},{"$f":"M121/(1+U121)/MAX(1,SUM(M$121:M$122/(1+U$121:U$122)))","v":0},{"$f":"ROUND(S121*R$121*(1+U121),2)","v":0},0,0,0,0,0,{"$f":"MIN(Y121,$G$140-$BA$140-SUM(Z$105:Z$108*N$105:N$108)-SUM(Z$110:Z120*N$110:N120))/N121","v":0},0,0,0,0,0,0,null,"Direzione Lavori architettonici",0,0,0,0,0,0,0,0,0,0.22,0,0,0,0,17]
[null,null,"Direzione Lavori strutturali",null,0,22,"Ordine",{"$f":"VLOOKUP(G122,SpeseTecniche!F$53:G$64,2,FALSE)","v":0},null,null,null,0,0,1.22,0,null,0,null,{"$f":"M122/(1+U122)/MAX(1,SUM(M$121:M$122/(1+U$121:U$122)))","v":0},{"$f":"ROUND(S122*R$121*(1+U122),2)","v":0},0,0,0,0,0,{"$f":"MIN(Y122,$G$140-$BA$140-SUM(Z$105:Z$108*N$105:N$108)-SUM(Z$110:Z121*N$110:N121))/N122","v":0},0,0,0,0,0,0,null,"Direzione Lavori strutturali",0,0,0,0,0,0,0,0,0,0.22,0,0,0,0,18]
[null,null,"Collaudo",null,0,22,"Ordine",{"$f":"VLOOKUP(G123,SpeseTecniche!F$53:G$64,2,FALSE)","v":0},null,null,null,0,0,1.22,0,null,0,{"$f":"SpeseTecniche!L$7","v":0},{"$f":"M123/(1+U123)/MAX(1,SUM(M$123:M$124/(1+U$123:U$124)))","v":0},{"$f":"ROUND(S123*R$123*(1+U123),2)","v":0},0,0,0,0,0,{"$f":"MIN(Y123,$G$140-$BA$140-SUM(Z$105:Z$108*N$105:N$108)-SUM(Z$110:Z122*N$110:N122))/N123","v":0},0,0,0,0,0,0,null,"Collaudo",0,0,0,0,0,0,0,0,0,0.22,0,0,0,0,19]
[null,null,"Certificazione energetica",null,0,22,"Ordine",{"$f":"VLOOKUP(G124,SpeseTecniche!F$53:G$64,2,FALSE)","v":0},null,null,null,0,0,1.22,0,null,0,null,{"$f":"M124/(1+U124)/MAX(1,SUM(M$123:M$124/(1+U$123:U$124)))","v":0},{"$f":"ROUND(S124*R$123*(1+U124),2)","v":0},0,0,0,0,0,{"$f":"MIN(Y124,$G$140-$BA$140-SUM(Z$105:Z$108*N$105:N$108)-SUM(Z$110:Z123*N$110:N123))/N124","v":0},0,0,0,0,0,0,null,"Certificazione energetica",0,0,0,0,0,0,0,0,0,0.22,0,0,0,0,20]
[null,null,"Relazione geologica",null,0,22,"Ordine",{"$f":"VLOOKUP(G125,SpeseTecniche!F$53:G$64,2,FALSE)","v":0},null,null,null,0,0,1.22,0,null,0,{"$f":"SpeseTecniche!E$32","v":0},{"$f":"SpeseTecniche!H$35","v":0},{"$f":"ROUND(S125*R$125*(1+U125),2)","v":0},0,0,0,0,0,{"$f":"MIN(Y125,$G$140-$BA$140-SUM(Z$105:Z$108*N$105:N$108)-SUM(Z$110:Z124*N$110:N124))/N125","v":0},0,0,0,0,0,0,null,"Relazione geologica",0,0,0,0,0,0,0,0,0,0.22,0,0,0,0,21]
[null,null,"Progettazioni specialistiche",null,0,22,"Ordine",{"$f":"VLOOKUP(G126,SpeseTecniche!F$53:G$64,2,FALSE)","v":0},null,null,null,0,0,1.22,0,null,0,null,{"$f":"SpeseTecniche!H$36","v":0},{"$f":"ROUND(S126*R$125*(1+U126),2)","v":0},0,0,0,0,0,{"$f":"MIN(Y126,$G$140-$BA$140-SUM(Z$105:Z$108*N$105:N$108)-SUM(Z$110:Z125*N$110:N125))/N126","v":0},0,0,0,0,0,0,null,"Progettazioni specialistiche",0,0,0,0,0,0,0,0,0,0.22,0,0,0,0,22]
[null,null,"Amministratore",null,0,22,null,null,null,null,null,0,0,1.22,0,null,null,{"$f":"SpeseTecniche!D$47","v":2E-12},{"$f":"M127/MAX(1,SUM(M$127))","v":0},{"$f":"ROUND(S127*R$127,2)","v":0},null,0,0,0,0,{"$f":"MIN(Y127,$G$140-$BA$140-SUM(Z$105:Z$108*N$105:N$108)-SUM(Z$110:Z126*N$110:N126))/N127","v":0},0,0,0,0,0,0,null,"Amministratore",{"$f":"E127","v":0},0,0,0,0,0,0,0,0,0.22,0,0,0,0,23]
[null,null,null,null,null,null,null,null,null,null,null,null,{"$f":"SUM(M105:M127)","v":1E-10},null,{"$f":"SUM(O105:O127)","v":1.1000000000000001E-10},null,null,null,null,{"$f":"SUM(T105:T127)","v":0},null,null,{"$f":"SUM(W105:W127)","v":1E-10},{"$f":"SUM(X105:X127)","v":1E-10},{"$f":"SUM(Y105:Y127)","v":1.1000000000000001E-10},{"$f":"SUM(Z105:Z127)","v":0},1.0000000000000002E-33,1.1000000000000004E-33,0,{"$f":"SUM(AD105:AD127)","v":1.1000000000000001E-10},{"$f":"SUM(AE105:AE127)","v":0},{"$f":"SUM(AF105:AF127)","v":1.1000000000000004E-33},null,"TOTALE PRESTAZIONI PROFESSIONALI",{"$f":"SUM(AI113:AI127)","v":0},{"$f":"SUM(AJ113:AJ127)","v":0},0,0,{"$f":"SUM(AM113:AM127)","v":0},{"$f":"SUM(AN113:AN127)","v":0},{"$f":"SUM(AO113:AO127)","v":0},{"$f":"SUM(AP113:AP127)","v":0},{"$f":"SUM(AQ113:AQ127)","v":0},null,{"$f":"SUM(AS113:AS127)","v":0},{"$f":"SUM(AT113:AT127)","v":0},{"$f":"SUM(AU113:AU127)","v":0},{"$f":"SUM(AV113:AV127)","v":0},"somma 9:23"]
[null,"Altre prestazioni professionali",null,null,null,null,null,null,null,null,null,null,null,null,null,null,null,null,null,null,null,null,null,null,null,null,null,null,null,null,null,null,null,"TOTALE GENERALE",{"$f":"AI104+AI128+SUM(AI110:AI112)","v":1E-10},{"$f":"AJ104+AJ128+SUM(AJ110:AJ112)","v":1E-10},0,{"$f":"AL104+AL128+SUM(AL110:AL112)","v":1E-10},{"$f":"AM104+AM128+SUM(AM110:AM112)","v":1.0000000000000002E-33},{"$f":"AN104+AN128+SUM(AN110:AN112)","v":1E-10},{"$f":"AO104+AO128+SUM(AO110:AO112)","v":1E-10},{"$f":"AP104+AP128+SUM(AP110:AP112)","v":0},{"$f":"AQ104+AQ128+SUM(AQ110:AQ112)","v":1.0000000000000002E-33},null,{"$f":"AS104+AS128+SUM(AS110:AS112)","v":1.0000000000000004E-34},{"$f":"AT104+AT128+SUM(AT110:AT112)","v":1.1000000000000004E-33},{"$f":"AU104+AU128+SUM(AU110:AU112)","v":0},{"$f":"AV104+AV128+SUM(AV110:AV112)","v":0}]
[null,"Prestazioni","Altre prestazioni professionali",{"$f":"SUM(D131:D135)","v":0},{"$f":"IF(D130>0,\"S\",\"N\")","v":"N"},null,null,null,null,null,null,null,null,null,null,null,null,null,null,null,null,null,null,null,null,null,null,null,null,null,null,null,null,"CONVENZIONALE (a)",null,null,null,{"$f":"AL140","v":4.0000000000000004E-11}]
[null,null,"Accatastamento",{"$f":"IF(E131=\"S\",1,0)","v":0},"N"]
[null,null,"Relazioni ambientali",{"$f":"IF(E132=\"S\",1,0)","v":0},"N"]
[null,null,"Rilievo geometrico-informatico",{"$f":"IF(E133=\"S\",1,0)","v":0},"N"]
[null,null,"Rilievo storico-critico",{"$f":"IF(E134=\"S\",1,0)","v":0},"N"]
[null,null,"Relazione geologica",{"$f":"IF(E135=\"S\",1,0)","v":0},"N"]
[]
[null,null,null,null,null,null,null,null,{"$f":"SUMIF(I$142:$I238,J137,X$142:X$241)","v":1E-13},"Privata",null,null,null,null,null,null,null,null,null,null,null,null,null,null,null,null,null,null,null,null,null,null,null,null,null,null,"Privata",{"$f":"SUMIF($I$142:$I$241,$AK137,AL$142:AL$241)","v":4.0000000000000004E-24},{"$f":"SUMIF($I$142:$I$241,$AK137,AM$142:AM$241)","v":1.0000000000000001E-23},0,1.0000000000000001E-23,1.0000000000000001E-23,0,1.0000000000000001E-23,null,{"$f":"SUMIF($I$142:$I$241,$AK137,AT$142:AT$241)","v":1.0000000000000001E-23},0,0,1.0000000000000001E-23,0,1.0000000000000001E-23,0,0,1.1000000000000001E-23,0,0,0,1.1000000000000001E-23,0,1.1000000000000001E-23,0,{"$f":"SUMIF($I$142:$I$241,$AK137,BJ$142:BJ$241)","v":4.0000000000000004E-11}]
[null,null,null,null,null,null,null,null,{"$f":"SUMIF(I$142:$I239,J138,X$142:X$241)","v":0},"Pubblica",null,null,null,null,null,null,null,null,null,null,null,null,null,null,null,null,null,null,null,null,null,null,null,null,null,null,"Pubblica",0,0,0,0,0,0,0,null,0,0,0,0,0,0,0,0,0,0,0,0,0,0,0,0,0]
[null,null,null,null,null,null,null,null,{"$f":"SUMIF(I$142:$I240,J139,X$142:X$241)","v":0},"ONLUS",null,null,null,null,null,null,null,null,null,null,null,null,null,null,null,null,null,null,null,null,null,null,null,null,null,null,"ONLUS",0,0,0,0,0,0,0,null,0,0,0,0,0,0,0,0,0,0,0,0,0,0,0,0,0]
["D1","UNITA IMMOBILIARI",null,null,{"$f":"AND(COUNTIF(E142:E241,\"S\")>0,COUNTIF(X142:X241,\">0\")>0)","v":true},null,{"$f":"SUM(G142:G241)","v":0},{"$f":"SUM(H142:H241)","v":0},null,null,{"$f":"IF(SUMIF(K$142:K$241,\"S\",$A$142:$A$241)>0,\"S\",\"N\")","v":"N"},{"$f":"SUM(L142:L241)","v":1E-13},{"$f":"SUM(M142:M241)","v":0},{"$f":"SUM(N142:N241)","v":0},{"$f":"SUM(O142:O241)","v":0},null,null,null,null,null,null,{"$f":"SUM(V142:V241)","v":1E-13},{"$f":"SUM(W142:W241)","v":0},{"$f":"SUM(X142:X241)","v":1E-13},null,"Principale",null,null,null,"Pertinenza esterna",null,null,null,{"$f":"SUM(AH142:AH241*$X142:$X241)","v":4.0000000000000004E-11},{"$f":"SUM(AI142:AI241*$X142:$X241)","v":3.3000000000000002E-11},{"$f":"SUM(AJ142:AJ241*$X142:$X241)","v":3E-11},{"$f":"SUM(AK142:AK241*$X142:$X241)","v":3E-11},{"$f":"BJ140","v":4.0000000000000004E-11},{"$f":"SUM(AM142:AM241)","v":1.0000000000000001E-23},0,{"$f":"SUM(AO142:AO241)","v":1.0000000000000001E-23},{"$f":"SUM(AP142:AP241)","v":1.0000000000000001E-23},{"$f":"SUM(AQ142:AQ241)","v":0},{"$f":"SUM(AR142:AR241)","v":1.0000000000000001E-23},{"$f":"IF(SUMIF(AS$142:AS$241,\"<1\",$A$142:$A$241)>0,\"S\",\"N\")","v":"N"},{"$f":"SUM(AT142:AT241)","v":1.0000000000000001E-23},{"$f":"SUM(AU142:AU241)","v":0},{"$f":"SUM(AV142:AV241)","v":0},{"$f":"SUM(AW142:AW241)","v":1.0000000000000001E-23},0,1.0000000000000001E-23,{"$f":"SUM(AZ142:AZ241)","v":0},{"$f":"SUM(BA142:BA241)","v":0},{"$f":"SUM(BB142:BB241)","v":1.1000000000000001E-23},{"$f":"SUM(BC142:BC241)","v":0},0,0,1.1000000000000001E-23,{"$f":"SUM(BG142:BG241)","v":0},{"$f":"SUM(BH142:BH241)","v":1.1000000000000001E-23},{"$f":"SUM(BI142:BI241)","v":0},{"$f":"SUM(BJ142:BJ241)","v":4.0000000000000004E-11}]
["COMUNI","INTERNI","UI","Edificio","Principale","Destinazione","Importo Assicurazione","Importo Finiture","Proprieta","IVA","IVA Detraibile","SuAbit","SuPertInt","SuPertEst","SuPartiComuni","Magazzino","Classe II","Livello","Mvincolo","Mabitazione","MperEst","Sabitazione","SperEst","Sup%","IdParametrico","G1","G2","G3","G4","G1","G2","G3","G4","CP1","CP2","CP3","CP4","Ponderale","PreCom","PreInt","PreTOT","PostCom","PostInt","PosTOT","Param%","ContrPreAss","AssiCom","AssiInt","ContrCom","ContrInt","ConTOT","AssComIVA","AssIntIVA","ContComIVA","ConIntIVA","AccIntIVA","AccComIVA","PreComIVA","PreIntIVA","PostComIVA","PostIntIVA","Parametrico","IVAint"]
[{"$f":"IF($E142=\"S\",I$9,I$10)","v":1},{"$f":"IF($E142=\"S\",J$9,J$10)","v":1},1,1,"S","A - Abitativo",0,0,"Privata",10,"N",1E-13,0,0,0,"N","N",{"$f":"E$23","v":"L0"},{"$f":"$F$50","v":0},{"$f":"$H$60+IF(AND($D$20=\"P\",OR(MID(F142,1,1)=\"A\",MID(F142,1,1)=\"D\")),80%,0)","v":0},{"$f":"$G$60","v":0},{"$f":"SUM(L142:M142,O142)","v":1E-13},{"$f":"MIN(70%*L142,N142)","v":0},{"$f":"(V142+W142)/MAX(1,(V$140+W$140))","v":1E-13},{"$f":"IF($D$22=\"DC\",$F$22,$E$20&\"-\"&R142)","v":"Abitativa-L0"},{"$f":"MAX(0,(V142)-AA142-AB142-AC142)","v":1E-13},{"$f":"MAX(0,(V142)-INDEX(CostoParametrico!$E$3:$L$18,MATCH($Y142,CostoParametrico!$D$3:$D$18,0),1)-AB142-AC142)*IF(AND($D$20=\"A\",MID($F142,1,1)<>\"A\"),0%,100%)","v":0},{"$f":"MAX(0,(V142)-INDEX(CostoParametrico!$E$3:$L$18,MATCH($Y142,CostoParametrico!$D$3:$D$18,0),2)-AC142)*IF(AND($D$20=\"A\",MID($F142,1,1)<>\"A\"),0%,100%)","v":0},{"$f":"MAX(0,(V142)-INDEX(CostoParametrico!$E$3:$L$18,MATCH($Y142,CostoParametrico!$D$3:$D$18,0),3))*IF(AND($D$20=\"A\",MID($F142,1,1)<>\"A\"),0%,100%)","v":0},{"$f":"MAX(0,(W142)-AC142-AE142-AF142-AG142)","v":0},{"$f":"MAX(0,(V142+W142)-INDEX(CostoParametrico!$E$3:$L$18,MATCH($Y142,CostoParametrico!$D$3:$D$18,0),1)-AA142-AB142-AC142-AF142-AG142)*IF(AND($D$20=\"A\",MID($F142,1,1)<>\"A\"),0%,100%)","v":0},{"$f":"MAX(0,(V142+W142)-INDEX(CostoParametrico!$E$3:$L$18,MATCH($Y142,CostoParametrico!$D$3:$D$18,0),2)-AB142-AC142-AG142)*IF(AND($D$20=\"A\",MID(F142,1,1)<>\"A\"),0%,100%)","v":0},{"$f":"MAX(0,(V142+W142)-INDEX(CostoParametrico!$E$3:$L$18,MATCH($Y142,CostoParametrico!$D$3:$D$18,0),3)-AC142)*IF(AND($D$20=\"A\",MID(F142,1,1)<>\"A\"),0%,100%)","v":0},{"$f":"INDEX(CostoParametrico!$E$3:$L$18,MATCH($Y142,CostoParametrico!$D$3:$D$18,0),5)","v":400},{"$f":"INDEX(CostoParametrico!$E$3:$L$18,MATCH($Y142,CostoParametrico!$D$3:$D$18,0),6)","v":330},{"$f":"INDEX(CostoParametrico!$E$3:$L$18,MATCH($Y142,CostoParametrico!$D$3:$D$18,0),7)","v":300},{"$f":"INDEX(CostoParametrico!$E$3:$L$18,MATCH($Y142,CostoParametrico!$D$3:$D$18,0),8)","v":300},{"$f":"((1+S142+T142)*(Z142*AH$140+AA142*AI$140+AB142*AJ$140+AC142*AK$140)\n+(1+S142+U142)*(AD142*AH$140+AE142*AI$140+AF142*AJ$140+AG142*AK$140))\n*(1+IF(P142=\"N\",0,$G$48))\n*(1+IF(AND(BM142=\"L4\",$D$23=\"DR\",$E$25=\"S\",$E$70=\"S\"),30%,0))\n*IF(AND($D$20=\"P\",MID(F142,1,1)=\"A\"),180%,100%)","v":4.0000000000000004E-24},{"$f":"($M$128-$M$109)*X142","v":1.0000000000000001E-23},{"$f":"H142*(1-M$102)","v":0},{"$f":"AM142+AN142","v":1.0000000000000001E-23},{"$f":"$X142*($X$128-$X$109)","v":1.0000000000000001E-23},{"$f":"IF($H$140>0,V$109,0)*AN142","v":0},{"$f":"AP142+AQ142","v":1.0000000000000001E-23},{"$f":"MIN(1,MAX(AL142,1)/MAX(AR142,1))","v":1},{"$f":"(AP142*A142+AQ142*B142)*AS142","v":1.0000000000000001E-23},{"$f":"AZ142*(Z$128-Z$109)/MAX(10^-12,AC$128-AC$109)","v":0},{"$f":"BA142/BK142","v":0},{"$f":"MAX(0,MIN(AP142,AT142)-AU142)","v":1.0000000000000001E-23},{"$f":"MAX(0,MIN(AQ142,AT142-AW142)-AV142)","v":0},{"$f":"MAX(0,AT142-AU142-AV142)","v":1.0000000000000001E-23},{"$f":"MAX(0,MIN(A142*AP142*AS142*($Y$128-$Y$109)/($X$128-$X$109),G142-BA142))","v":0},{"$f":"MAX(0,MIN(B142*AQ142*BK142,G142))","v":0},{"$f":"MAX(0,MIN(AP142,AT142)*($Y$128-$Y$109)/($X$128-$X$109)-AZ142)","v":1.1000000000000001E-23},{"$f":"MAX(0,AX142*BK142-BA142)","v":0},{"$f":"AN142*(1+J142/100)-BC142-BA142","v":0},{"$f":"AM142*($O$128-$O$109)/($M$128-$M$109)-(BB142+AZ142)","v":0},{"$f":"AM142*($O$128-$O$109)/($M$128-$M$109)","v":1.1000000000000001E-23},{"$f":"AN142*(1+J142/100)","v":0},{"$f":"$X142*($Y$128-$Y$109)","v":1.1000000000000001E-23},{"$f":"AQ142*(1+J142/100)","v":0},{"$f":"((1+S142+T142)*(Z142*AH142+AA142*AI142+AB142*AJ142+AC142*AK142)\n+(1+S142+U142)*(AD142*AH142+AE142*AI142+AF142*AJ142+AG142*AK142))\n*(1+IF(P142=\"N\",0,$G$48))\n*(1+IF(AND(R142=\"L4\",$D$23=\"DR\",$E$25=\"S\",$E$70=\"S\"),30%,0))","v":4.0000000000000004E-11},{"$f":"(1+J142/100*(1-IF(K142=\"N\",0,IF($F$19=0,1,$F$19))))","v":1.1000000000000001}]
[1,1,2,1,"N","A - Abitativo",0,0,"Privata",10,"N",0,0,0,0,"N","N",{"$f":"E$23","v":"L0"},0,{"$f":"$H$60+IF(AND($D$20=\"P\",OR(MID(F143,1,1)=\"A\",MID(F143,1,1)=\"D\")),80%,0)","v":0},0,0,0,{"$f":"(V143+W143)/MAX(1,(V$140+W$140))","v":0},"Abitativa-L0",{"$f":"MAX(0,(V143)-AA143-AB143-AC143)","v":0},{"$f":"MAX(0,(V143)-INDEX(CostoParametrico!$E$3:$L$18,MATCH($Y143,CostoParametrico!$D$3:$D$18,0),1)-AB143-AC143)*IF(AND($D$20=\"A\",MID($F143,1,1)<>\"A\"),0%,100%)","v":0},{"$f":"MAX(0,(V143)-INDEX(CostoParametrico!$E$3:$L$18,MATCH($Y143,CostoParametrico!$D$3:$D$18,0),2)-AC143)*IF(AND($D$20=\"A\",MID($F143,1,1)<>\"A\"),0%,100%)","v":0},{"$f":"MAX(0,(V143)-INDEX(CostoParametrico!$E$3:$L$18,MATCH($Y143,CostoParametrico!$D$3:$D$18,0),3))*IF(AND($D$20=\"A\",MID($F143,1,1)<>\"A\"),0%,100%)","v":0},{"$f":"MAX(0,(W143)-AC143-AE143-AF143-AG143)","v":0},{"$f":"MAX(0,(V143+W143)-INDEX(CostoParametrico!$E$3:$L$18,MATCH($Y143,CostoParametrico!$D$3:$D$18,0),1)-AA143-AB143-AC143-AF143-AG143)*IF(AND($D$20=\"A\",MID($F143,1,1)<>\"A\"),0%,100%)","v":0},{"$f":"MAX(0,(V143+W143)-INDEX(CostoParametrico!$E$3:$L$18,MATCH($Y143,CostoParametrico!$D$3:$D$18,0),2)-AB143-AC143-AG143)*IF(AND($D$20=\"A\",MID(F143,1,1)<>\"A\"),0%,100%)","v":0},{"$f":"MAX(0,(V143+W143)-INDEX(CostoParametrico!$E$3:$L$18,MATCH($Y143,CostoParametrico!$D$3:$D$18,0),3)-AC143)*IF(AND($D$20=\"A\",MID(F143,1,1)<>\"A\"),0%,100%)","v":0},{"$f":"INDEX(CostoParametrico!$E$3:$L$18,MATCH($Y143,CostoParametrico!$D$3:$D$18,0),5)","v":400},{"$f":"INDEX(CostoParametrico!$E$3:$L$18,MATCH($Y143,CostoParametrico!$D$3:$D$18,0),6)","v":330},{"$f":"INDEX(CostoParametrico!$E$3:$L$18,MATCH($Y143,CostoParametrico!$D$3:$D$18,0),7)","v":300},{"$f":"INDEX(CostoParametrico!$E$3:$L$18,MATCH($Y143,CostoParametrico!$D$3:$D$18,0),8)","v":300},{"$f":"((1+S143+T143)*(Z143*AH$140+AA143*AI$140+AB143*AJ$140+AC143*AK$140)\n+(1+S143+U143)*(AD143*AH$140+AE143*AI$140+AF143*AJ$140+AG143*AK$140))\n*(1+IF(P143=\"N\",0,$G$48))\n*(1+IF(AND(BM143=\"L4\",$D$23=\"DR\",$E$25=\"S\",$E$70=\"S\"),30%,0))\n*IF(AND($D$20=\"P\",MID(F143,1,1)=\"A\"),180%,100%)","v":0},0,{"$f":"H143*(1-M$102)","v":0},0,0,{"$f":"IF($H$140>0,V$109,0)*AN143","v":0},0,1,{"$f":"(AP143*A143+AQ143*B143)*AS143","v":0},{"$f":"AZ143*(Z$128-Z$109)/MAX(10^-12,AC$128-AC$109)","v":0},0,{"$f":"MAX(0,MIN(AP143,AT143)-AU143)","v":0},{"$f":"MAX(0,MIN(AQ143,AT143-AW143)-AV143)","v":0},{"$f":"MAX(0,AT143-AU143-AV143)","v":0},{"$f":"MAX(0,MIN(A143*AP143*AS143*($Y$128-$Y$109)/($X$128-$X$109),G143-BA143))","v":0},{"$f":"MAX(0,MIN(B143*AQ143*BK143,G143))","v":0},{"$f":"MAX(0,MIN(AP143,AT143)*($Y$128-$Y$109)/($X$128-$X$109)-AZ143)","v":0},{"$f":"MAX(0,AX143*BK143-BA143)","v":0},{"$f":"AN143*(1+J143/100)-BC143-BA143","v":0},{"$f":"AM143*($O$128-$O$109)/($M$128-$M$109)-(BB143+AZ143)","v":0},{"$f":"AM143*($O$128-$O$109)/($M$128-$M$109)","v":0},0,{"$f":"$X143*($Y$128-$Y$109)","v":0},{"$f":"AQ143*(1+J143/100)","v":0},{"$f":"((1+S143+T143)*(Z143*AH143+AA143*AI143+AB143*AJ143+AC143*AK143)\n+(1+S143+U143)*(AD143*AH143+AE143*AI143+AF143*AJ143+AG143*AK143))\n*(1+IF(P143=\"N\",0,$G$48))\n*(1+IF(AND(R143=\"L4\",$D$23=\"DR\",$E$25=\"S\",$E$70=\"S\"),30%,0))","v":0},1.1000000000000001]
[1,1,3,1,"N","A - Abitativo",0,0,"Privata",10,"N",0,0,0,0,"N","N","L0",0,0,0,0,0,0,"Abitativa-L0",0,{"$f":"MAX(0,(V144)-INDEX(CostoParametrico!$E$3:$L$18,MATCH($Y144,CostoParametrico!$D$3:$D$18,0),1)-AB144-AC144)*IF(AND($D$20=\"A\",MID($F144,1,1)<>\"A\"),0%,100%)","v":0},{"$f":"MAX(0,(V144)-INDEX(CostoParametrico!$E$3:$L$18,MATCH($Y144,CostoParametrico!$D$3:$D$18,0),2)-AC144)*IF(AND($D$20=\"A\",MID($F144,1,1)<>\"A\"),0%,100%)","v":0},{"$f":"MAX(0,(V144)-INDEX(CostoParametrico!$E$3:$L$18,MATCH($Y144,CostoParametrico!$D$3:$D$18,0),3))*IF(AND($D$20=\"A\",MID($F144,1,1)<>\"A\"),0%,100%)","v":0},0,{"$f":"MAX(0,(V144+W144)-INDEX(CostoParametrico!$E$3:$L$18,MATCH($Y144,CostoParametrico!$D$3:$D$18,0),1)-AA144-AB144-AC144-AF144-AG144)*IF(AND($D$20=\"A\",MID($F144,1,1)<>\"A\"),0%,100%)","v":0},{"$f":"MAX(0,(V144+W144)-INDEX(CostoParametrico!$E$3:$L$18,MATCH($Y144,CostoParametrico!$D$3:$D$18,0),2)-AB144-AC144-AG144)*IF(AND($D$20=\"A\",MID(F144,1,1)<>\"A\"),0%,100%)","v":0},{"$f":"MAX(0,(V144+W144)-INDEX(CostoParametrico!$E$3:$L$18,MATCH($Y144,CostoParametrico!$D$3:$D$18,0),3)-AC144)*IF(AND($D$20=\"A\",MID(F144,1,1)<>\"A\"),0%,100%)","v":0},{"$f":"INDEX(CostoParametrico!$E$3:$L$18,MATCH($Y144,CostoParametrico!$D$3:$D$18,0),5)","v":400},{"$f":"INDEX(CostoParametrico!$E$3:$L$18,MATCH($Y144,CostoParametrico!$D$3:$D$18,0),6)","v":330},{"$f":"INDEX(CostoParametrico!$E$3:$L$18,MATCH($Y144,CostoParametrico!$D$3:$D$18,0),7)","v":300},{"$f":"INDEX(CostoParametrico!$E$3:$L$18,MATCH($Y144,CostoParametrico!$D$3:$D$18,0),8)","v":300},0,0,0,0,0,0,0,1,0,0,0,0,0,0,0,0,0,0,0,0,0,0,0,0,0,1.1000000000000001]
[1,1,4,1,"N","A - Abitativo",0,0,"Privata",10,"N",0,0,0,0,"N","N","L0",0,0,0,0,0,0,"Abitativa-L0",0,{"$f":"MAX(0,(V145)-INDEX(CostoParametrico!$E$3:$L$18,MATCH($Y145,CostoParametrico!$D$3:$D$18,0),1)-AB145-AC145)*IF(AND($D$20=\"A\",MID($F145,1,1)<>\"A\"),0%,100%)","v":0},{"$f":"MAX(0,(V145)-INDEX(CostoParametrico!$E$3:$L$18,MATCH($Y145,CostoParametrico!$D$3:$D$18,0),2)-AC145)*IF(AND($D$20=\"A\",MID($F145,1,1)<>\"A\"),0%,100%)","v":0},{"$f":"MAX(0,(V145)-INDEX(CostoParametrico!$E$3:$L$18,MATCH($Y145,CostoParametrico!$D$3:$D$18,0),3))*IF(AND($D$20=\"A\",MID($F145,1,1)<>\"A\"),0%,100%)","v":0},0,{"$f":"MAX(0,(V145+W145)-INDEX(CostoParametrico!$E$3:$L$18,MATCH($Y145,CostoParametrico!$D$3:$D$18,0),1)-AA145-AB145-AC145-AF145-AG145)*IF(AND($D$20=\"A\",MID($F145,1,1)<>\"A\"),0%,100%)","v":0},{"$f":"MAX(0,(V145+W145)-INDEX(CostoParametrico!$E$3:$L$18,MATCH($Y145,CostoParametrico!$D$3:$D$18,0),2)-AB145-AC145-AG145)*IF(AND($D$20=\"A\",MID(F145,1,1)<>\"A\"),0%,100%)","v":0},{"$f":"MAX(0,(V145+W145)-INDEX(CostoParametrico!$E$3:$L$18,MATCH($Y145,CostoParametrico!$D$3:$D$18,0),3)-AC145)*IF(AND($D$20=\"A\",MID(F145,1,1)<>\"A\"),0%,100%)","v":0},{"$f":"INDEX(CostoParametrico!$E$3:$L$18,MATCH($Y145,CostoParametrico!$D$3:$D$18,0),5)","v":400},{"$f":"INDEX(CostoParametrico!$E$3:$L$18,MATCH($Y145,CostoParametrico!$D$3:$D$18,0),6)","v":330},{"$f":"INDEX(CostoParametrico!$E$3:$L$18,MATCH($Y145,CostoParametrico!$D$3:$D$18,0),7)","v":300},{"$f":"INDEX(CostoParametrico!$E$3:$L$18,MATCH($Y145,CostoParametrico!$D$3:$D$18,0),8)","v":300},0,0,0,0,0,0,0,1,0,0,0,0,0,0,0,0,0,0,0,0,0,0,0,0,0,1.1000000000000001]
[1,1,5,1,"N","A - Abitativo",0,0,"Privata",10,"N",0,0,0,0,"N","N","L0",0,0,0,0,0,0,"Abitativa-L0",0,{"$f":"MAX(0,(V146)-INDEX(CostoParametrico!$E$3:$L$18,MATCH($Y146,CostoParametrico!$D$3:$D$18,0),1)-AB146-AC146)*IF(AND($D$20=\"A\",MID($F146,1,1)<>\"A\"),0%,100%)","v":0},{"$f":"MAX(0,(V146)-INDEX(CostoParametrico!$E$3:$L$18,MATCH($Y146,CostoParametrico!$D$3:$D$18,0),2)-AC146)*IF(AND($D$20=\"A\",MID($F146,1,1)<>\"A\"),0%,100%)","v":0},{"$f":"MAX(0,(V146)-INDEX(CostoParametrico!$E$3:$L$18,MATCH($Y146,CostoParametrico!$D$3:$D$18,0),3))*IF(AND($D$20=\"A\",MID($F146,1,1)<>\"A\"),0%,100%)","v":0},0,{"$f":"MAX(0,(V146+W146)-INDEX(CostoParametrico!$E$3:$L$18,MATCH($Y146,CostoParametrico!$D$3:$D$18,0),1)-AA146-AB146-AC146-AF146-AG146)*IF(AND($D$20=\"A\",MID($F146,1,1)<>\"A\"),0%,100%)","v":0},{"$f":"MAX(0,(V146+W146)-INDEX(CostoParametrico!$E$3:$L$18,MATCH($Y146,CostoParametrico!$D$3:$D$18,0),2)-AB146-AC146-AG146)*IF(AND($D$20=\"A\",MID(F146,1,1)<>\"A\"),0%,100%)","v":0},{"$f":"MAX(0,(V146+W146)-INDEX(CostoParametrico!$E$3:$L$18,MATCH($Y146,CostoParametrico!$D$3:$D$18,0),3)-AC146)*IF(AND($D$20=\"A\",MID(F146,1,1)<>\"A\"),0%,100%)","v":0},{"$f":"INDEX(CostoParametrico!$E$3:$L$18,MATCH($Y146,CostoParametrico!$D$3:$D$18,0),5)","v":400},{"$f":"INDEX(CostoParametrico!$E$3:$L$18,MATCH($Y146,CostoParametrico!$D$3:$D$18,0),6)","v":330},{"$f":"INDEX(CostoParametrico!$E$3:$L$18,MATCH($Y146,CostoParametrico!$D$3:$D$18,0),7)","v":300},{"$f":"INDEX(CostoParametrico!$E$3:$L$18,MATCH($Y146,CostoParametrico!$D$3:$D$18,0),8)","v":300},0,0,0,0,0,0,0,1,0,0,0,0,0,0,0,0,0,0,0,0,0,0,0,0,0,1.1000000000000001]
[1,1,6,1,"N","A - Abitativo",0,0,"Privata",10,"N",0,0,0,0,"N","N","L0",0,0,0,0,0,0,"Abitativa-L0",0,{"$f":"MAX(0,(V147)-INDEX(CostoParametrico!$E$3:$L$18,MATCH($Y147,CostoParametrico!$D$3:$D$18,0),1)-AB147-AC147)*IF(AND($D$20=\"A\",MID($F147,1,1)<>\"A\"),0%,100%)","v":0},{"$f":"MAX(0,(V147)-INDEX(CostoParametrico!$E$3:$L$18,MATCH($Y147,CostoParametrico!$D$3:$D$18,0),2)-AC147)*IF(AND($D$20=\"A\",MID($F147,1,1)<>\"A\"),0%,100%)","v":0},{"$f":"MAX(0,(V147)-INDEX(CostoParametrico!$E$3:$L$18,MATCH($Y147,CostoParametrico!$D$3:$D$18,0),3))*IF(AND($D$20=\"A\",MID($F147,1,1)<>\"A\"),0%,100%)","v":0},0,{"$f":"MAX(0,(V147+W147)-INDEX(CostoParametrico!$E$3:$L$18,MATCH($Y147,CostoParametrico!$D$3:$D$18,0),1)-AA147-AB147-AC147-AF147-AG147)*IF(AND($D$20=\"A\",MID($F147,1,1)<>\"A\"),0%,100%)","v":0},{"$f":"MAX(0,(V147+W147)-INDEX(CostoParametrico!$E$3:$L$18,MATCH($Y147,CostoParametrico!$D$3:$D$18,0),2)-AB147-AC147-AG147)*IF(AND($D$20=\"A\",MID(F147,1,1)<>\"A\"),0%,100%)","v":0},{"$f":"MAX(0,(V147+W147)-INDEX(CostoParametrico!$E$3:$L$18,MATCH($Y147,CostoParametrico!$D$3:$D$18,0),3)-AC147)*IF(AND($D$20=\"A\",MID(F147,1,1)<>\"A\"),0%,100%)","v":0},{"$f":"INDEX(CostoParametrico!$E$3:$L$18,MATCH($Y147,CostoParametrico!$D$3:$D$18,0),5)","v":400},{"$f":"INDEX(CostoParametrico!$E$3:$L$18,MATCH($Y147,CostoParametrico!$D$3:$D$18,0),6)","v":330},{"$f":"INDEX(CostoParametrico!$E$3:$L$18,MATCH($Y147,CostoParametrico!$D$3:$D$18,0),7)","v":300},{"$f":"INDEX(CostoParametrico!$E$3:$L$18,MATCH($Y147,CostoParametrico!$D$3:$D$18,0),8)","v":300},0,0,0,0,0,0,0,1,0,0,0,0,0,0,0,0,0,0,0,0,0,0,0,0,0,1.1000000000000001]
[1,1,7,1,"N","A - Abitativo",0,0,"Privata",10,"N",0,0,0,0,"N","N","L0",0,0,0,0,0,0,"Abitativa-L0",0,{"$f":"MAX(0,(V148)-INDEX(CostoParametrico!$E$3:$L$18,MATCH($Y148,CostoParametrico!$D$3:$D$18,0),1)-AB148-AC148)*IF(AND($D$20=\"A\",MID($F148,1,1)<>\"A\"),0%,100%)","v":0},{"$f":"MAX(0,(V148)-INDEX(CostoParametrico!$E$3:$L$18,MATCH($Y148,CostoParametrico!$D$3:$D$18,0),2)-AC148)*IF(AND($D$20=\"A\",MID($F148,1,1)<>\"A\"),0%,100%)","v":0},{"$f":"MAX(0,(V148)-INDEX(CostoParametrico!$E$3:$L$18,MATCH($Y148,CostoParametrico!$D$3:$D$18,0),3))*IF(AND($D$20=\"A\",MID($F148,1,1)<>\"A\"),0%,100%)","v":0},0,{"$f":"MAX(0,(V148+W148)-INDEX(CostoParametrico!$E$3:$L$18,MATCH($Y148,CostoParametrico!$D$3:$D$18,0),1)-AA148-AB148-AC148-AF148-AG148)*IF(AND($D$20=\"A\",MID($F148,1,1)<>\"A\"),0%,100%)","v":0},{"$f":"MAX(0,(V148+W148)-INDEX(CostoParametrico!$E$3:$L$18,MATCH($Y148,CostoParametrico!$D$3:$D$18,0),2)-AB148-AC148-AG148)*IF(AND($D$20=\"A\",MID(F148,1,1)<>\"A\"),0%,100%)","v":0},{"$f":"MAX(0,(V148+W148)-INDEX(CostoParametrico!$E$3:$L$18,MATCH($Y148,CostoParametrico!$D$3:$D$18,0),3)-AC148)*IF(AND($D$20=\"A\",MID(F148,1,1)<>\"A\"),0%,100%)","v":0},{"$f":"INDEX(CostoParametrico!$E$3:$L$18,MATCH($Y148,CostoParametrico!$D$3:$D$18,0),5)","v":400},{"$f":"INDEX(CostoParametrico!$E$3:$L$18,MATCH($Y148,CostoParametrico!$D$3:$D$18,0),6)","v":330},{"$f":"INDEX(CostoParametrico!$E$3:$L$18,MATCH($Y148,CostoParametrico!$D$3:$D$18,0),7)","v":300},{"$f":"INDEX(CostoParametrico!$E$3:$L$18,MATCH($Y148,CostoParametrico!$D$3:$D$18,0),8)","v":300},0,0,0,0,0,0,0,1,0,0,0,0,0,0,0,0,0,0,0,0,0,0,0,0,0,1.1000000000000001]
[1,1,8,1,"N","A - Abitativo",0,0,"Privata",10,"N",0,0,0,0,"N","N","L0",0,0,0,0,0,0,"Abitativa-L0",0,{"$f":"MAX(0,(V149)-INDEX(CostoParametrico!$E$3:$L$18,MATCH($Y149,CostoParametrico!$D$3:$D$18,0),1)-AB149-AC149)*IF(AND($D$20=\"A\",MID($F149,1,1)<>\"A\"),0%,100%)","v":0},{"$f":"MAX(0,(V149)-INDEX(CostoParametrico!$E$3:$L$18,MATCH($Y149,CostoParametrico!$D$3:$D$18,0),2)-AC149)*IF(AND($D$20=\"A\",MID($F149,1,1)<>\"A\"),0%,100%)","v":0},{"$f":"MAX(0,(V149)-INDEX(CostoParametrico!$E$3:$L$18,MATCH($Y149,CostoParametrico!$D$3:$D$18,0),3))*IF(AND($D$20=\"A\",MID($F149,1,1)<>\"A\"),0%,100%)","v":0},0,{"$f":"MAX(0,(V149+W149)-INDEX(CostoParametrico!$E$3:$L$18,MATCH($Y149,CostoParametrico!$D$3:$D$18,0),1)-AA149-AB149-AC149-AF149-AG149)*IF(AND($D$20=\"A\",MID($F149,1,1)<>\"A\"),0%,100%)","v":0},{"$f":"MAX(0,(V149+W149)-INDEX(CostoParametrico!$E$3:$L$18,MATCH($Y149,CostoParametrico!$D$3:$D$18,0),2)-AB149-AC149-AG149)*IF(AND($D$20=\"A\",MID(F149,1,1)<>\"A\"),0%,100%)","v":0},{"$f":"MAX(0,(V149+W149)-INDEX(CostoParametrico!$E$3:$L$18,MATCH($Y149,CostoParametrico!$D$3:$D$18,0),3)-AC149)*IF(AND($D$20=\"A\",MID(F149,1,1)<>\"A\"),0%,100%)","v":0},{"$f":"INDEX(CostoParametrico!$E$3:$L$18,MATCH($Y149,CostoParametrico!$D$3:$D$18,0),5)","v":400},{"$f":"INDEX(CostoParametrico!$E$3:$L$18,MATCH($Y149,CostoParametrico!$D$3:$D$18,0),6)","v":330},{"$f":"INDEX(CostoParametrico!$E$3:$L$18,MATCH($Y149,CostoParametrico!$D$3:$D$18,0),7)","v":300},{"$f":"INDEX(CostoParametrico!$E$3:$L$18,MATCH($Y149,CostoParametrico!$D$3:$D$18,0),8)","v":300},0,0,0,0,0,0,0,1,0,0,0,0,0,0,0,0,0,0,0,0,0,0,0,0,0,1.1000000000000001]
[1,1,9,1,"N","A - Abitativo",0,0,"Privata",10,"N",0,0,0,0,"N","N","L0",0,0,0,0,0,0,"Abitativa-L0",0,{"$f":"MAX(0,(V150)-INDEX(CostoParametrico!$E$3:$L$18,MATCH($Y150,CostoParametrico!$D$3:$D$18,0),1)-AB150-AC150)*IF(AND($D$20=\"A\",MID($F150,1,1)<>\"A\"),0%,100%)","v":0},{"$f":"MAX(0,(V150)-INDEX(CostoParametrico!$E$3:$L$18,MATCH($Y150,CostoParametrico!$D$3:$D$18,0),2)-AC150)*IF(AND($D$20=\"A\",MID($F150,1,1)<>\"A\"),0%,100%)","v":0},{"$f":"MAX(0,(V150)-INDEX(CostoParametrico!$E$3:$L$18,MATCH($Y150,CostoParametrico!$D$3:$D$18,0),3))*IF(AND($D$20=\"A\",MID($F150,1,1)<>\"A\"),0%,100%)","v":0},0,{"$f":"MAX(0,(V150+W150)-INDEX(CostoParametrico!$E$3:$L$18,MATCH($Y150,CostoParametrico!$D$3:$D$18,0),1)-AA150-AB150-AC150-AF150-AG150)*IF(AND($D$20=\"A\",MID($F150,1,1)<>\"A\"),0%,100%)","v":0},{"$f":"MAX(0,(V150+W150)-INDEX(CostoParametrico!$E$3:$L$18,MATCH($Y150,CostoParametrico!$D$3:$D$18,0),2)-AB150-AC150-AG150)*IF(AND($D$20=\"A\",MID(F150,1,1)<>\"A\"),0%,100%)","v":0},{"$f":"MAX(0,(V150+W150)-INDEX(CostoParametrico!$E$3:$L$18,MATCH($Y150,CostoParametrico!$D$3:$D$18,0),3)-AC150)*IF(AND($D$20=\"A\",MID(F150,1,1)<>\"A\"),0%,100%)","v":0},{"$f":"INDEX(CostoParametrico!$E$3:$L$18,MATCH($Y150,CostoParametrico!$D$3:$D$18,0),5)","v":400},{"$f":"INDEX(CostoParametrico!$E$3:$L$18,MATCH($Y150,CostoParametrico!$D$3:$D$18,0),6)","v":330},{"$f":"INDEX(CostoParametrico!$E$3:$L$18,MATCH($Y150,CostoParametrico!$D$3:$D$18,0),7)","v":300},{"$f":"INDEX(CostoParametrico!$E$3:$L$18,MATCH($Y150,CostoParametrico!$D$3:$D$18,0),8)","v":300},0,0,0,0,0,0,0,1,0,0,0,0,0,0,0,0,0,0,0,0,0,0,0,0,0,1.1000000000000001]
[1,1,10,1,"N","A - Abitativo",0,0,"Privata",10,"N",0,0,0,0,"N","N","L0",0,0,0,0,0,0,"Abitativa-L0",0,{"$f":"MAX(0,(V151)-INDEX(CostoParametrico!$E$3:$L$18,MATCH($Y151,CostoParametrico!$D$3:$D$18,0),1)-AB151-AC151)*IF(AND($D$20=\"A\",MID($F151,1,1)<>\"A\"),0%,100%)","v":0},{"$f":"MAX(0,(V151)-INDEX(CostoParametrico!$E$3:$L$18,MATCH($Y151,CostoParametrico!$D$3:$D$18,0),2)-AC151)*IF(AND($D$20=\"A\",MID($F151,1,1)<>\"A\"),0%,100%)","v":0},{"$f":"MAX(0,(V151)-INDEX(CostoParametrico!$E$3:$L$18,MATCH($Y151,CostoParametrico!$D$3:$D$18,0),3))*IF(AND($D$20=\"A\",MID($F151,1,1)<>\"A\"),0%,100%)","v":0},0,{"$f":"MAX(0,(V151+W151)-INDEX(CostoParametrico!$E$3:$L$18,MATCH($Y151,CostoParametrico!$D$3:$D$18,0),1)-AA151-AB151-AC151-AF151-AG151)*IF(AND($D$20=\"A\",MID($F151,1,1)<>\"A\"),0%,100%)","v":0},{"$f":"MAX(0,(V151+W151)-INDEX(CostoParametrico!$E$3:$L$18,MATCH($Y151,CostoParametrico!$D$3:$D$18,0),2)-AB151-AC151-AG151)*IF(AND($D$20=\"A\",MID(F151,1,1)<>\"A\"),0%,100%)","v":0},{"$f":"MAX(0,(V151+W151)-INDEX(CostoParametrico!$E$3:$L$18,MATCH($Y151,CostoParametrico!$D$3:$D$18,0),3)-AC151)*IF(AND($D$20=\"A\",MID(F151,1,1)<>\"A\"),0%,100%)","v":0},{"$f":"INDEX(CostoParametrico!$E$3:$L$18,MATCH($Y151,CostoParametrico!$D$3:$D$18,0),5)","v":400},{"$f":"INDEX(CostoParametrico!$E$3:$L$18,MATCH($Y151,CostoParametrico!$D$3:$D$18,0),6)","v":330},{"$f":"INDEX(CostoParametrico!$E$3:$L$18,MATCH($Y151,CostoParametrico!$D$3:$D$18,0),7)","v":300},{"$f":"INDEX(CostoParametrico!$E$3:$L$18,MATCH($Y151,CostoParametrico!$D$3:$D$18,0),8)","v":300},0,0,0,0,0,0,0,1,0,0,0,0,0,0,0,0,0,0,0,0,0,0,0,0,0,1.1000000000000001]
[1,1,11,1,"N","A - Abitativo",0,0,"Privata",10,"N",0,0,0,0,"N","N","L0",0,0,0,0,0,0,"Abitativa-L0",0,{"$f":"MAX(0,(V152)-INDEX(CostoParametrico!$E$3:$L$18,MATCH($Y152,CostoParametrico!$D$3:$D$18,0),1)-AB152-AC152)*IF(AND($D$20=\"A\",MID($F152,1,1)<>\"A\"),0%,100%)","v":0},{"$f":"MAX(0,(V152)-INDEX(CostoParametrico!$E$3:$L$18,MATCH($Y152,CostoParametrico!$D$3:$D$18,0),2)-AC152)*IF(AND($D$20=\"A\",MID($F152,1,1)<>\"A\"),0%,100%)","v":0},{"$f":"MAX(0,(V152)-INDEX(CostoParametrico!$E$3:$L$18,MATCH($Y152,CostoParametrico!$D$3:$D$18,0),3))*IF(AND($D$20=\"A\",MID($F152,1,1)<>\"A\"),0%,100%)","v":0},0,{"$f":"MAX(0,(V152+W152)-INDEX(CostoParametrico!$E$3:$L$18,MATCH($Y152,CostoParametrico!$D$3:$D$18,0),1)-AA152-AB152-AC152-AF152-AG152)*IF(AND($D$20=\"A\",MID($F152,1,1)<>\"A\"),0%,100%)","v":0},{"$f":"MAX(0,(V152+W152)-INDEX(CostoParametrico!$E$3:$L$18,MATCH($Y152,CostoParametrico!$D$3:$D$18,0),2)-AB152-AC152-AG152)*IF(AND($D$20=\"A\",MID(F152,1,1)<>\"A\"),0%,100%)","v":0},{"$f":"MAX(0,(V152+W152)-INDEX(CostoParametrico!$E$3:$L$18,MATCH($Y152,CostoParametrico!$D$3:$D$18,0),3)-AC152)*IF(AND($D$20=\"A\",MID(F152,1,1)<>\"A\"),0%,100%)","v":0},{"$f":"INDEX(CostoParametrico!$E$3:$L$18,MATCH($Y152,CostoParametrico!$D$3:$D$18,0),5)","v":400},{"$f":"INDEX(CostoParametrico!$E$3:$L$18,MATCH($Y152,CostoParametrico!$D$3:$D$18,0),6)","v":330},{"$f":"INDEX(CostoParametrico!$E$3:$L$18,MATCH($Y152,CostoParametrico!$D$3:$D$18,0),7)","v":300},{"$f":"INDEX(CostoParametrico!$E$3:$L$18,MATCH($Y152,CostoParametrico!$D$3:$D$18,0),8)","v":300},0,0,0,0,0,0,0,1,0,0,0,0,0,0,0,0,0,0,0,0,0,0,0,0,0,1.1000000000000001]
[1,1,12,1,"N","A - Abitativo",0,0,"Privata",10,"N",0,0,0,0,"N","N","L0",0,0,0,0,0,0,"Abitativa-L0",0,{"$f":"MAX(0,(V153)-INDEX(CostoParametrico!$E$3:$L$18,MATCH($Y153,CostoParametrico!$D$3:$D$18,0),1)-AB153-AC153)*IF(AND($D$20=\"A\",MID($F153,1,1)<>\"A\"),0%,100%)","v":0},{"$f":"MAX(0,(V153)-INDEX(CostoParametrico!$E$3:$L$18,MATCH($Y153,CostoParametrico!$D$3:$D$18,0),2)-AC153)*IF(AND($D$20=\"A\",MID($F153,1,1)<>\"A\"),0%,100%)","v":0},{"$f":"MAX(0,(V153)-INDEX(CostoParametrico!$E$3:$L$18,MATCH($Y153,CostoParametrico!$D$3:$D$18,0),3))*IF(AND($D$20=\"A\",MID($F153,1,1)<>\"A\"),0%,100%)","v":0},0,{"$f":"MAX(0,(V153+W153)-INDEX(CostoParametrico!$E$3:$L$18,MATCH($Y153,CostoParametrico!$D$3:$D$18,0),1)-AA153-AB153-AC153-AF153-AG153)*IF(AND($D$20=\"A\",MID($F153,1,1)<>\"A\"),0%,100%)","v":0},{"$f":"MAX(0,(V153+W153)-INDEX(CostoParametrico!$E$3:$L$18,MATCH($Y153,CostoParametrico!$D$3:$D$18,0),2)-AB153-AC153-AG153)*IF(AND($D$20=\"A\",MID(F153,1,1)<>\"A\"),0%,100%)","v":0},{"$f":"MAX(0,(V153+W153)-INDEX(CostoParametrico!$E$3:$L$18,MATCH($Y153,CostoParametrico!$D$3:$D$18,0),3)-AC153)*IF(AND($D$20=\"A\",MID(F153,1,1)<>\"A\"),0%,100%)","v":0},{"$f":"INDEX(CostoParametrico!$E$3:$L$18,MATCH($Y153,CostoParametrico!$D$3:$D$18,0),5)","v":400},{"$f":"INDEX(CostoParametrico!$E$3:$L$18,MATCH($Y153,CostoParametrico!$D$3:$D$18,0),6)","v":330},{"$f":"INDEX(CostoParametrico!$E$3:$L$18,MATCH($Y153,CostoParametrico!$D$3:$D$18,0),7)","v":300},{"$f":"INDEX(CostoParametrico!$E$3:$L$18,MATCH($Y153,CostoParametrico!$D$3:$D$18,0),8)","v":300},0,0,0,0,0,0,0,1,0,0,0,0,0,0,0,0,0,0,0,0,0,0,0,0,0,1.1000000000000001]
[1,1,13,1,"N","A - Abitativo",0,0,"Privata",10,"N",0,0,0,0,"N","N","L0",0,0,0,0,0,0,"Abitativa-L0",0,{"$f":"MAX(0,(V154)-INDEX(CostoParametrico!$E$3:$L$18,MATCH($Y154,CostoParametrico!$D$3:$D$18,0),1)-AB154-AC154)*IF(AND($D$20=\"A\",MID($F154,1,1)<>\"A\"),0%,100%)","v":0},{"$f":"MAX(0,(V154)-INDEX(CostoParametrico!$E$3:$L$18,MATCH($Y154,CostoParametrico!$D$3:$D$18,0),2)-AC154)*IF(AND($D$20=\"A\",MID($F154,1,1)<>\"A\"),0%,100%)","v":0},{"$f":"MAX(0,(V154)-INDEX(CostoParametrico!$E$3:$L$18,MATCH($Y154,CostoParametrico!$D$3:$D$18,0),3))*IF(AND($D$20=\"A\",MID($F154,1,1)<>\"A\"),0%,100%)","v":0},0,{"$f":"MAX(0,(V154+W154)-INDEX(CostoParametrico!$E$3:$L$18,MATCH($Y154,CostoParametrico!$D$3:$D$18,0),1)-AA154-AB154-AC154-AF154-AG154)*IF(AND($D$20=\"A\",MID($F154,1,1)<>\"A\"),0%,100%)","v":0},{"$f":"MAX(0,(V154+W154)-INDEX(CostoParametrico!$E$3:$L$18,MATCH($Y154,CostoParametrico!$D$3:$D$18,0),2)-AB154-AC154-AG154)*IF(AND($D$20=\"A\",MID(F154,1,1)<>\"A\"),0%,100%)","v":0},{"$f":"MAX(0,(V154+W154)-INDEX(CostoParametrico!$E$3:$L$18,MATCH($Y154,CostoParametrico!$D$3:$D$18,0),3)-AC154)*IF(AND($D$20=\"A\",MID(F154,1,1)<>\"A\"),0%,100%)","v":0},{"$f":"INDEX(CostoParametrico!$E$3:$L$18,MATCH($Y154,CostoParametrico!$D$3:$D$18,0),5)","v":400},{"$f":"INDEX(CostoParametrico!$E$3:$L$18,MATCH($Y154,CostoParametrico!$D$3:$D$18,0),6)","v":330},{"$f":"INDEX(CostoParametrico!$E$3:$L$18,MATCH($Y154,CostoParametrico!$D$3:$D$18,0),7)","v":300},{"$f":"INDEX(CostoParametrico!$E$3:$L$18,MATCH($Y154,CostoParametrico!$D$3:$D$18,0),8)","v":300},0,0,0,0,0,0,0,1,0,0,0,0,0,0,0,0,0,0,0,0,0,0,0,0,0,1.1000000000000001]
[1,1,14,1,"N","A - Abitativo",0,0,"Privata",10,"N",0,0,0,0,"N","N","L0",0,0,0,0,0,0,"Abitativa-L0",0,{"$f":"MAX(0,(V155)-INDEX(CostoParametrico!$E$3:$L$18,MATCH($Y155,CostoParametrico!$D$3:$D$18,0),1)-AB155-AC155)*IF(AND($D$20=\"A\",MID($F155,1,1)<>\"A\"),0%,100%)","v":0},{"$f":"MAX(0,(V155)-INDEX(CostoParametrico!$E$3:$L$18,MATCH($Y155,CostoParametrico!$D$3:$D$18,0),2)-AC155)*IF(AND($D$20=\"A\",MID($F155,1,1)<>\"A\"),0%,100%)","v":0},{"$f":"MAX(0,(V155)-INDEX(CostoParametrico!$E$3:$L$18,MATCH($Y155,CostoParametrico!$D$3:$D$18,0),3))*IF(AND($D$20=\"A\",MID($F155,1,1)<>\"A\"),0%,100%)","v":0},0,{"$f":"MAX(0,(V155+W155)-INDEX(CostoParametrico!$E$3:$L$18,MATCH($Y155,CostoParametrico!$D$3:$D$18,0),1)-AA155-AB155-AC155-AF155-AG155)*IF(AND($D$20=\"A\",MID($F155,1,1)<>\"A\"),0%,100%)","v":0},{"$f":"MAX(0,(V155+W155)-INDEX(CostoParametrico!$E$3:$L$18,MATCH($Y155,CostoParametrico!$D$3:$D$18,0),2)-AB155-AC155-AG155)*IF(AND($D$20=\"A\",MID(F155,1,1)<>\"A\"),0%,100%)","v":0},{"$f":"MAX(0,(V155+W155)-INDEX(CostoParametrico!$E$3:$L$18,MATCH($Y155,CostoParametrico!$D$3:$D$18,0),3)-AC155)*IF(AND($D$20=\"A\",MID(F155,1,1)<>\"A\"),0%,100%)","v":0},{"$f":"INDEX(CostoParametrico!$E$3:$L$18,MATCH($Y155,CostoParametrico!$D$3:$D$18,0),5)","v":400},{"$f":"INDEX(CostoParametrico!$E$3:$L$18,MATCH($Y155,CostoParametrico!$D$3:$D$18,0),6)","v":330},{"$f":"INDEX(CostoParametrico!$E$3:$L$18,MATCH($Y155,CostoParametrico!$D$3:$D$18,0),7)","v":300},{"$f":"INDEX(CostoParametrico!$E$3:$L$18,MATCH($Y155,CostoParametrico!$D$3:$D$18,0),8)","v":300},0,0,0,0,0,0,0,1,0,0,0,0,0,0,0,0,0,0,0,0,0,0,0,0,0,1.1000000000000001]
[1,1,15,1,"N","A - Abitativo",0,0,"Privata",10,"N",0,0,0,0,"N","N","L0",0,0,0,0,0,0,"Abitativa-L0",0,{"$f":"MAX(0,(V156)-INDEX(CostoParametrico!$E$3:$L$18,MATCH($Y156,CostoParametrico!$D$3:$D$18,0),1)-AB156-AC156)*IF(AND($D$20=\"A\",MID($F156,1,1)<>\"A\"),0%,100%)","v":0},{"$f":"MAX(0,(V156)-INDEX(CostoParametrico!$E$3:$L$18,MATCH($Y156,CostoParametrico!$D$3:$D$18,0),2)-AC156)*IF(AND($D$20=\"A\",MID($F156,1,1)<>\"A\"),0%,100%)","v":0},{"$f":"MAX(0,(V156)-INDEX(CostoParametrico!$E$3:$L$18,MATCH($Y156,CostoParametrico!$D$3:$D$18,0),3))*IF(AND($D$20=\"A\",MID($F156,1,1)<>\"A\"),0%,100%)","v":0},0,{"$f":"MAX(0,(V156+W156)-INDEX(CostoParametrico!$E$3:$L$18,MATCH($Y156,CostoParametrico!$D$3:$D$18,0),1)-AA156-AB156-AC156-AF156-AG156)*IF(AND($D$20=\"A\",MID($F156,1,1)<>\"A\"),0%,100%)","v":0},{"$f":"MAX(0,(V156+W156)-INDEX(CostoParametrico!$E$3:$L$18,MATCH($Y156,CostoParametrico!$D$3:$D$18,0),2)-AB156-AC156-AG156)*IF(AND($D$20=\"A\",MID(F156,1,1)<>\"A\"),0%,100%)","v":0},{"$f":"MAX(0,(V156+W156)-INDEX(CostoParametrico!$E$3:$L$18,MATCH($Y156,CostoParametrico!$D$3:$D$18,0),3)-AC156)*IF(AND($D$20=\"A\",MID(F156,1,1)<>\"A\"),0%,100%)","v":0},{"$f":"INDEX(CostoParametrico!$E$3:$L$18,MATCH($Y156,CostoParametrico!$D$3:$D$18,0),5)","v":400},{"$f":"INDEX(CostoParametrico!$E$3:$L$18,MATCH($Y156,CostoParametrico!$D$3:$D$18,0),6)","v":330},{"$f":"INDEX(CostoParametrico!$E$3:$L$18,MATCH($Y156,CostoParametrico!$D$3:$D$18,0),7)","v":300},{"$f":"INDEX(CostoParametrico!$E$3:$L$18,MATCH($Y156,CostoParametrico!$D$3:$D$18,0),8)","v":300},0,0,0,0,0,0,0,1,0,0,0,0,0,0,0,0,0,0,0,0,0,0,0,0,0,1.1000000000000001]
[1,1,16,1,"N","A - Abitativo",0,0,"Privata",10,"N",0,0,0,0,"N","N","L0",0,0,0,0,0,0,"Abitativa-L0",0,{"$f":"MAX(0,(V157)-INDEX(CostoParametrico!$E$3:$L$18,MATCH($Y157,CostoParametrico!$D$3:$D$18,0),1)-AB157-AC157)*IF(AND($D$20=\"A\",MID($F157,1,1)<>\"A\"),0%,100%)","v":0},{"$f":"MAX(0,(V157)-INDEX(CostoParametrico!$E$3:$L$18,MATCH($Y157,CostoParametrico!$D$3:$D$18,0),2)-AC157)*IF(AND($D$20=\"A\",MID($F157,1,1)<>\"A\"),0%,100%)","v":0},{"$f":"MAX(0,(V157)-INDEX(CostoParametrico!$E$3:$L$18,MATCH($Y157,CostoParametrico!$D$3:$D$18,0),3))*IF(AND($D$20=\"A\",MID($F157,1,1)<>\"A\"),0%,100%)","v":0},0,{"$f":"MAX(0,(V157+W157)-INDEX(CostoParametrico!$E$3:$L$18,MATCH($Y157,CostoParametrico!$D$3:$D$18,0),1)-AA157-AB157-AC157-AF157-AG157)*IF(AND($D$20=\"A\",MID($F157,1,1)<>\"A\"),0%,100%)","v":0},{"$f":"MAX(0,(V157+W157)-INDEX(CostoParametrico!$E$3:$L$18,MATCH($Y157,CostoParametrico!$D$3:$D$18,0),2)-AB157-AC157-AG157)*IF(AND($D$20=\"A\",MID(F157,1,1)<>\"A\"),0%,100%)","v":0},{"$f":"MAX(0,(V157+W157)-INDEX(CostoParametrico!$E$3:$L$18,MATCH($Y157,CostoParametrico!$D$3:$D$18,0),3)-AC157)*IF(AND($D$20=\"A\",MID(F157,1,1)<>\"A\"),0%,100%)","v":0},{"$f":"INDEX(CostoParametrico!$E$3:$L$18,MATCH($Y157,CostoParametrico!$D$3:$D$18,0),5)","v":400},{"$f":"INDEX(CostoParametrico!$E$3:$L$18,MATCH($Y157,CostoParametrico!$D$3:$D$18,0),6)","v":330},{"$f":"INDEX(CostoParametrico!$E$3:$L$18,MATCH($Y157,CostoParametrico!$D$3:$D$18,0),7)","v":300},{"$f":"INDEX(CostoParametrico!$E$3:$L$18,MATCH($Y157,CostoParametrico!$D$3:$D$18,0),8)","v":300},0,0,0,0,0,0,0,1,0,0,0,0,0,0,0,0,0,0,0,0,0,0,0,0,0,1.1000000000000001]
[1,1,17,1,"N","A - Abitativo",0,0,"Privata",10,"N",0,0,0,0,"N","N","L0",0,0,0,0,0,0,"Abitativa-L0",0,{"$f":"MAX(0,(V158)-INDEX(CostoParametrico!$E$3:$L$18,MATCH($Y158,CostoParametrico!$D$3:$D$18,0),1)-AB158-AC158)*IF(AND($D$20=\"A\",MID($F158,1,1)<>\"A\"),0%,100%)","v":0},{"$f":"MAX(0,(V158)-INDEX(CostoParametrico!$E$3:$L$18,MATCH($Y158,CostoParametrico!$D$3:$D$18,0),2)-AC158)*IF(AND($D$20=\"A\",MID($F158,1,1)<>\"A\"),0%,100%)","v":0},{"$f":"MAX(0,(V158)-INDEX(CostoParametrico!$E$3:$L$18,MATCH($Y158,CostoParametrico!$D$3:$D$18,0),3))*IF(AND($D$20=\"A\",MID($F158,1,1)<>\"A\"),0%,100%)","v":0},0,{"$f":"MAX(0,(V158+W158)-INDEX(CostoParametrico!$E$3:$L$18,MATCH($Y158,CostoParametrico!$D$3:$D$18,0),1)-AA158-AB158-AC158-AF158-AG158)*IF(AND($D$20=\"A\",MID($F158,1,1)<>\"A\"),0%,100%)","v":0},{"$f":"MAX(0,(V158+W158)-INDEX(CostoParametrico!$E$3:$L$18,MATCH($Y158,CostoParametrico!$D$3:$D$18,0),2)-AB158-AC158-AG158)*IF(AND($D$20=\"A\",MID(F158,1,1)<>\"A\"),0%,100%)","v":0},{"$f":"MAX(0,(V158+W158)-INDEX(CostoParametrico!$E$3:$L$18,MATCH($Y158,CostoParametrico!$D$3:$D$18,0),3)-AC158)*IF(AND($D$20=\"A\",MID(F158,1,1)<>\"A\"),0%,100%)","v":0},{"$f":"INDEX(CostoParametrico!$E$3:$L$18,MATCH($Y158,CostoParametrico!$D$3:$D$18,0),5)","v":400},{"$f":"INDEX(CostoParametrico!$E$3:$L$18,MATCH($Y158,CostoParametrico!$D$3:$D$18,0),6)","v":330},{"$f":"INDEX(CostoParametrico!$E$3:$L$18,MATCH($Y158,CostoParametrico!$D$3:$D$18,0),7)","v":300},{"$f":"INDEX(CostoParametrico!$E$3:$L$18,MATCH($Y158,CostoParametrico!$D$3:$D$18,0),8)","v":300},0,0,0,0,0,0,0,1,0,0,0,0,0,0,0,0,0,0,0,0,0,0,0,0,0,1.1000000000000001]
[1,1,18,1,"N","A - Abitativo",0,0,"Privata",10,"N",0,0,0,0,"N","N","L0",0,0,0,0,0,0,"Abitativa-L0",0,{"$f":"MAX(0,(V159)-INDEX(CostoParametrico!$E$3:$L$18,MATCH($Y159,CostoParametrico!$D$3:$D$18,0),1)-AB159-AC159)*IF(AND($D$20=\"A\",MID($F159,1,1)<>\"A\"),0%,100%)","v":0},{"$f":"MAX(0,(V159)-INDEX(CostoParametrico!$E$3:$L$18,MATCH($Y159,CostoParametrico!$D$3:$D$18,0),2)-AC159)*IF(AND($D$20=\"A\",MID($F159,1,1)<>\"A\"),0%,100%)","v":0},{"$f":"MAX(0,(V159)-INDEX(CostoParametrico!$E$3:$L$18,MATCH($Y159,CostoParametrico!$D$3:$D$18,0),3))*IF(AND($D$20=\"A\",MID($F159,1,1)<>\"A\"),0%,100%)","v":0},0,{"$f":"MAX(0,(V159+W159)-INDEX(CostoParametrico!$E$3:$L$18,MATCH($Y159,CostoParametrico!$D$3:$D$18,0),1)-AA159-AB159-AC159-AF159-AG159)*IF(AND($D$20=\"A\",MID($F159,1,1)<>\"A\"),0%,100%)","v":0},{"$f":"MAX(0,(V159+W159)-INDEX(CostoParametrico!$E$3:$L$18,MATCH($Y159,CostoParametrico!$D$3:$D$18,0),2)-AB159-AC159-AG159)*IF(AND($D$20=\"A\",MID(F159,1,1)<>\"A\"),0%,100%)","v":0},{"$f":"MAX(0,(V159+W159)-INDEX(CostoParametrico!$E$3:$L$18,MATCH($Y159,CostoParametrico!$D$3:$D$18,0),3)-AC159)*IF(AND($D$20=\"A\",MID(F159,1,1)<>\"A\"),0%,100%)","v":0},{"$f":"INDEX(CostoParametrico!$E$3:$L$18,MATCH($Y159,CostoParametrico!$D$3:$D$18,0),5)","v":400},{"$f":"INDEX(CostoParametrico!$E$3:$L$18,MATCH($Y159,CostoParametrico!$D$3:$D$18,0),6)","v":330},{"$f":"INDEX(CostoParametrico!$E$3:$L$18,MATCH($Y159,CostoParametrico!$D$3:$D$18,0),7)","v":300},{"$f":"INDEX(CostoParametrico!$E$3:$L$18,MATCH($Y159,CostoParametrico!$D$3:$D$18,0),8)","v":300},0,0,0,0,0,0,0,1,0,0,0,0,0,0,0,0,0,0,0,0,0,0,0,0,0,1.1000000000000001]
[1,1,19,1,"N","A - Abitativo",0,0,"Privata",10,"N",0,0,0,0,"N","N","L0",0,0,0,0,0,0,"Abitativa-L0",0,{"$f":"MAX(0,(V160)-INDEX(CostoParametrico!$E$3:$L$18,MATCH($Y160,CostoParametrico!$D$3:$D$18,0),1)-AB160-AC160)*IF(AND($D$20=\"A\",MID($F160,1,1)<>\"A\"),0%,100%)","v":0},{"$f":"MAX(0,(V160)-INDEX(CostoParametrico!$E$3:$L$18,MATCH($Y160,CostoParametrico!$D$3:$D$18,0),2)-AC160)*IF(AND($D$20=\"A\",MID($F160,1,1)<>\"A\"),0%,100%)","v":0},{"$f":"MAX(0,(V160)-INDEX(CostoParametrico!$E$3:$L$18,MATCH($Y160,CostoParametrico!$D$3:$D$18,0),3))*IF(AND($D$20=\"A\",MID($F160,1,1)<>\"A\"),0%,100%)","v":0},0,{"$f":"MAX(0,(V160+W160)-INDEX(CostoParametrico!$E$3:$L$18,MATCH($Y160,CostoParametrico!$D$3:$D$18,0),1)-AA160-AB160-AC160-AF160-AG160)*IF(AND($D$20=\"A\",MID($F160,1,1)<>\"A\"),0%,100%)","v":0},{"$f":"MAX(0,(V160+W160)-INDEX(CostoParametrico!$E$3:$L$18,MATCH($Y160,CostoParametrico!$D$3:$D$18,0),2)-AB160-AC160-AG160)*IF(AND($D$20=\"A\",MID(F160,1,1)<>\"A\"),0%,100%)","v":0},{"$f":"MAX(0,(V160+W160)-INDEX(CostoParametrico!$E$3:$L$18,MATCH($Y160,CostoParametrico!$D$3:$D$18,0),3)-AC160)*IF(AND($D$20=\"A\",MID(F160,1,1)<>\"A\"),0%,100%)","v":0},{"$f":"INDEX(CostoParametrico!$E$3:$L$18,MATCH($Y160,CostoParametrico!$D$3:$D$18,0),5)","v":400},{"$f":"INDEX(CostoParametrico!$E$3:$L$18,MATCH($Y160,CostoParametrico!$D$3:$D$18,0),6)","v":330},{"$f":"INDEX(CostoParametrico!$E$3:$L$18,MATCH($Y160,CostoParametrico!$D$3:$D$18,0),7)","v":300},{"$f":"INDEX(CostoParametrico!$E$3:$L$18,MATCH($Y160,CostoParametrico!$D$3:$D$18,0),8)","v":300},0,0,0,0,0,0,0,1,0,0,0,0,0,0,0,0,0,0,0,0,0,0,0,0,0,1.1000000000000001]
[1,1,20,1,"N","A - Abitativo",0,0,"Privata",10,"N",0,0,0,0,"N","N","L0",0,0,0,0,0,0,"Abitativa-L0",0,{"$f":"MAX(0,(V161)-INDEX(CostoParametrico!$E$3:$L$18,MATCH($Y161,CostoParametrico!$D$3:$D$18,0),1)-AB161-AC161)*IF(AND($D$20=\"A\",MID($F161,1,1)<>\"A\"),0%,100%)","v":0},{"$f":"MAX(0,(V161)-INDEX(CostoParametrico!$E$3:$L$18,MATCH($Y161,CostoParametrico!$D$3:$D$18,0),2)-AC161)*IF(AND($D$20=\"A\",MID($F161,1,1)<>\"A\"),0%,100%)","v":0},{"$f":"MAX(0,(V161)-INDEX(CostoParametrico!$E$3:$L$18,MATCH($Y161,CostoParametrico!$D$3:$D$18,0),3))*IF(AND($D$20=\"A\",MID($F161,1,1)<>\"A\"),0%,100%)","v":0},0,{"$f":"MAX(0,(V161+W161)-INDEX(CostoParametrico!$E$3:$L$18,MATCH($Y161,CostoParametrico!$D$3:$D$18,0),1)-AA161-AB161-AC161-AF161-AG161)*IF(AND($D$20=\"A\",MID($F161,1,1)<>\"A\"),0%,100%)","v":0},{"$f":"MAX(0,(V161+W161)-INDEX(CostoParametrico!$E$3:$L$18,MATCH($Y161,CostoParametrico!$D$3:$D$18,0),2)-AB161-AC161-AG161)*IF(AND($D$20=\"A\",MID(F161,1,1)<>\"A\"),0%,100%)","v":0},{"$f":"MAX(0,(V161+W161)-INDEX(CostoParametrico!$E$3:$L$18,MATCH($Y161,CostoParametrico!$D$3:$D$18,0),3)-AC161)*IF(AND($D$20=\"A\",MID(F161,1,1)<>\"A\"),0%,100%)","v":0},{"$f":"INDEX(CostoParametrico!$E$3:$L$18,MATCH($Y161,CostoParametrico!$D$3:$D$18,0),5)","v":400},{"$f":"INDEX(CostoParametrico!$E$3:$L$18,MATCH($Y161,CostoParametrico!$D$3:$D$18,0),6)","v":330},{"$f":"INDEX(CostoParametrico!$E$3:$L$18,MATCH($Y161,CostoParametrico!$D$3:$D$18,0),7)","v":300},{"$f":"INDEX(CostoParametrico!$E$3:$L$18,MATCH($Y161,CostoParametrico!$D$3:$D$18,0),8)","v":300},0,0,0,0,0,0,0,1,0,0,0,0,0,0,0,0,0,0,0,0,0,0,0,0,0,1.1000000000000001]
[1,1,21,1,"N","A - Abitativo",0,0,"Privata",10,"N",0,0,0,0,"N","N","L0",0,0,0,0,0,0,"Abitativa-L0",0,{"$f":"MAX(0,(V162)-INDEX(CostoParametrico!$E$3:$L$18,MATCH($Y162,CostoParametrico!$D$3:$D$18,0),1)-AB162-AC162)*IF(AND($D$20=\"A\",MID($F162,1,1)<>\"A\"),0%,100%)","v":0},{"$f":"MAX(0,(V162)-INDEX(CostoParametrico!$E$3:$L$18,MATCH($Y162,CostoParametrico!$D$3:$D$18,0),2)-AC162)*IF(AND($D$20=\"A\",MID($F162,1,1)<>\"A\"),0%,100%)","v":0},{"$f":"MAX(0,(V162)-INDEX(CostoParametrico!$E$3:$L$18,MATCH($Y162,CostoParametrico!$D$3:$D$18,0),3))*IF(AND($D$20=\"A\",MID($F162,1,1)<>\"A\"),0%,100%)","v":0},0,{"$f":"MAX(0,(V162+W162)-INDEX(CostoParametrico!$E$3:$L$18,MATCH($Y162,CostoParametrico!$D$3:$D$18,0),1)-AA162-AB162-AC162-AF162-AG162)*IF(AND($D$20=\"A\",MID($F162,1,1)<>\"A\"),0%,100%)","v":0},{"$f":"MAX(0,(V162+W162)-INDEX(CostoParametrico!$E$3:$L$18,MATCH($Y162,CostoParametrico!$D$3:$D$18,0),2)-AB162-AC162-AG162)*IF(AND($D$20=\"A\",MID(F162,1,1)<>\"A\"),0%,100%)","v":0},{"$f":"MAX(0,(V162+W162)-INDEX(CostoParametrico!$E$3:$L$18,MATCH($Y162,CostoParametrico!$D$3:$D$18,0),3)-AC162)*IF(AND($D$20=\"A\",MID(F162,1,1)<>\"A\"),0%,100%)","v":0},{"$f":"INDEX(CostoParametrico!$E$3:$L$18,MATCH($Y162,CostoParametrico!$D$3:$D$18,0),5)","v":400},{"$f":"INDEX(CostoParametrico!$E$3:$L$18,MATCH($Y162,CostoParametrico!$D$3:$D$18,0),6)","v":330},{"$f":"INDEX(CostoParametrico!$E$3:$L$18,MATCH($Y162,CostoParametrico!$D$3:$D$18,0),7)","v":300},{"$f":"INDEX(CostoParametrico!$E$3:$L$18,MATCH($Y162,CostoParametrico!$D$3:$D$18,0),8)","v":300},0,0,0,0,0,0,0,1,0,0,0,0,0,0,0,0,0,0,0,0,0,0,0,0,0,1.1000000000000001]
[1,1,22,1,"N","A - Abitativo",0,0,"Privata",10,"N",0,0,0,0,"N","N","L0",0,0,0,0,0,0,"Abitativa-L0",0,{"$f":"MAX(0,(V163)-INDEX(CostoParametrico!$E$3:$L$18,MATCH($Y163,CostoParametrico!$D$3:$D$18,0),1)-AB163-AC163)*IF(AND($D$20=\"A\",MID($F163,1,1)<>\"A\"),0%,100%)","v":0},{"$f":"MAX(0,(V163)-INDEX(CostoParametrico!$E$3:$L$18,MATCH($Y163,CostoParametrico!$D$3:$D$18,0),2)-AC163)*IF(AND($D$20=\"A\",MID($F163,1,1)<>\"A\"),0%,100%)","v":0},{"$f":"MAX(0,(V163)-INDEX(CostoParametrico!$E$3:$L$18,MATCH($Y163,CostoParametrico!$D$3:$D$18,0),3))*IF(AND($D$20=\"A\",MID($F163,1,1)<>\"A\"),0%,100%)","v":0},0,{"$f":"MAX(0,(V163+W163)-INDEX(CostoParametrico!$E$3:$L$18,MATCH($Y163,CostoParametrico!$D$3:$D$18,0),1)-AA163-AB163-AC163-AF163-AG163)*IF(AND($D$20=\"A\",MID($F163,1,1)<>\"A\"),0%,100%)","v":0},{"$f":"MAX(0,(V163+W163)-INDEX(CostoParametrico!$E$3:$L$18,MATCH($Y163,CostoParametrico!$D$3:$D$18,0),2)-AB163-AC163-AG163)*IF(AND($D$20=\"A\",MID(F163,1,1)<>\"A\"),0%,100%)","v":0},{"$f":"MAX(0,(V163+W163)-INDEX(CostoParametrico!$E$3:$L$18,MATCH($Y163,CostoParametrico!$D$3:$D$18,0),3)-AC163)*IF(AND($D$20=\"A\",MID(F163,1,1)<>\"A\"),0%,100%)","v":0},{"$f":"INDEX(CostoParametrico!$E$3:$L$18,MATCH($Y163,CostoParametrico!$D$3:$D$18,0),5)","v":400},{"$f":"INDEX(CostoParametrico!$E$3:$L$18,MATCH($Y163,CostoParametrico!$D$3:$D$18,0),6)","v":330},{"$f":"INDEX(CostoParametrico!$E$3:$L$18,MATCH($Y163,CostoParametrico!$D$3:$D$18,0),7)","v":300},{"$f":"INDEX(CostoParametrico!$E$3:$L$18,MATCH($Y163,CostoParametrico!$D$3:$D$18,0),8)","v":300},0,0,0,0,0,0,0,1,0,0,0,0,0,0,0,0,0,0,0,0,0,0,0,0,0,1.1000000000000001]
[1,1,23,1,"N","A - Abitativo",0,0,"Privata",10,"N",0,0,0,0,"N","N","L0",0,0,0,0,0,0,"Abitativa-L0",0,{"$f":"MAX(0,(V164)-INDEX(CostoParametrico!$E$3:$L$18,MATCH($Y164,CostoParametrico!$D$3:$D$18,0),1)-AB164-AC164)*IF(AND($D$20=\"A\",MID($F164,1,1)<>\"A\"),0%,100%)","v":0},{"$f":"MAX(0,(V164)-INDEX(CostoParametrico!$E$3:$L$18,MATCH($Y164,CostoParametrico!$D$3:$D$18,0),2)-AC164)*IF(AND($D$20=\"A\",MID($F164,1,1)<>\"A\"),0%,100%)","v":0},{"$f":"MAX(0,(V164)-INDEX(CostoParametrico!$E$3:$L$18,MATCH($Y164,CostoParametrico!$D$3:$D$18,0),3))*IF(AND($D$20=\"A\",MID($F164,1,1)<>\"A\"),0%,100%)","v":0},0,{"$f":"MAX(0,(V164+W164)-INDEX(CostoParametrico!$E$3:$L$18,MATCH($Y164,CostoParametrico!$D$3:$D$18,0),1)-AA164-AB164-AC164-AF164-AG164)*IF(AND($D$20=\"A\",MID($F164,1,1)<>\"A\"),0%,100%)","v":0},{"$f":"MAX(0,(V164+W164)-INDEX(CostoParametrico!$E$3:$L$18,MATCH($Y164,CostoParametrico!$D$3:$D$18,0),2)-AB164-AC164-AG164)*IF(AND($D$20=\"A\",MID(F164,1,1)<>\"A\"),0%,100%)","v":0},{"$f":"MAX(0,(V164+W164)-INDEX(CostoParametrico!$E$3:$L$18,MATCH($Y164,CostoParametrico!$D$3:$D$18,0),3)-AC164)*IF(AND($D$20=\"A\",MID(F164,1,1)<>\"A\"),0%,100%)","v":0},{"$f":"INDEX(CostoParametrico!$E$3:$L$18,MATCH($Y164,CostoParametrico!$D$3:$D$18,0),5)","v":400},{"$f":"INDEX(CostoParametrico!$E$3:$L$18,MATCH($Y164,CostoParametrico!$D$3:$D$18,0),6)","v":330},{"$f":"INDEX(CostoParametrico!$E$3:$L$18,MATCH($Y164,CostoParametrico!$D$3:$D$18,0),7)","v":300},{"$f":"INDEX(CostoParametrico!$E$3:$L$18,MATCH($Y164,CostoParametrico!$D$3:$D$18,0),8)","v":300},0,0,0,0,0,0,0,1,0,0,0,0,0,0,0,0,0,0,0,0,0,0,0,0,0,1.1000000000000001]
[1,1,24,1,"N","A - Abitativo",0,0,"Privata",10,"N",0,0,0,0,"N","N","L0",0,0,0,0,0,0,"Abitativa-L0",0,{"$f":"MAX(0,(V165)-INDEX(CostoParametrico!$E$3:$L$18,MATCH($Y165,CostoParametrico!$D$3:$D$18,0),1)-AB165-AC165)*IF(AND($D$20=\"A\",MID($F165,1,1)<>\"A\"),0%,100%)","v":0},{"$f":"MAX(0,(V165)-INDEX(CostoParametrico!$E$3:$L$18,MATCH($Y165,CostoParametrico!$D$3:$D$18,0),2)-AC165)*IF(AND($D$20=\"A\",MID($F165,1,1)<>\"A\"),0%,100%)","v":0},{"$f":"MAX(0,(V165)-INDEX(CostoParametrico!$E$3:$L$18,MATCH($Y165,CostoParametrico!$D$3:$D$18,0),3))*IF(AND($D$20=\"A\",MID($F165,1,1)<>\"A\"),0%,100%)","v":0},0,{"$f":"MAX(0,(V165+W165)-INDEX(CostoParametrico!$E$3:$L$18,MATCH($Y165,CostoParametrico!$D$3:$D$18,0),1)-AA165-AB165-AC165-AF165-AG165)*IF(AND($D$20=\"A\",MID($F165,1,1)<>\"A\"),0%,100%)","v":0},{"$f":"MAX(0,(V165+W165)-INDEX(CostoParametrico!$E$3:$L$18,MATCH($Y165,CostoParametrico!$D$3:$D$18,0),2)-AB165-AC165-AG165)*IF(AND($D$20=\"A\",MID(F165,1,1)<>\"A\"),0%,100%)","v":0},{"$f":"MAX(0,(V165+W165)-INDEX(CostoParametrico!$E$3:$L$18,MATCH($Y165,CostoParametrico!$D$3:$D$18,0),3)-AC165)*IF(AND($D$20=\"A\",MID(F165,1,1)<>\"A\"),0%,100%)","v":0},{"$f":"INDEX(CostoParametrico!$E$3:$L$18,MATCH($Y165,CostoParametrico!$D$3:$D$18,0),5)","v":400},{"$f":"INDEX(CostoParametrico!$E$3:$L$18,MATCH($Y165,CostoParametrico!$D$3:$D$18,0),6)","v":330},{"$f":"INDEX(CostoParametrico!$E$3:$L$18,MATCH($Y165,CostoParametrico!$D$3:$D$18,0),7)","v":300},{"$f":"INDEX(CostoParametrico!$E$3:$L$18,MATCH($Y165,CostoParametrico!$D$3:$D$18,0),8)","v":300},0,0,0,0,0,0,0,1,0,0,0,0,0,0,0,0,0,0,0,0,0,0,0,0,0,1.1000000000000001]
[1,1,25,1,"N","A - Abitativo",0,0,"Privata",10,"N",0,0,0,0,"N","N","L0",0,0,0,0,0,0,"Abitativa-L0",0,{"$f":"MAX(0,(V166)-INDEX(CostoParametrico!$E$3:$L$18,MATCH($Y166,CostoParametrico!$D$3:$D$18,0),1)-AB166-AC166)*IF(AND($D$20=\"A\",MID($F166,1,1)<>\"A\"),0%,100%)","v":0},{"$f":"MAX(0,(V166)-INDEX(CostoParametrico!$E$3:$L$18,MATCH($Y166,CostoParametrico!$D$3:$D$18,0),2)-AC166)*IF(AND($D$20=\"A\",MID($F166,1,1)<>\"A\"),0%,100%)","v":0},{"$f":"MAX(0,(V166)-INDEX(CostoParametrico!$E$3:$L$18,MATCH($Y166,CostoParametrico!$D$3:$D$18,0),3))*IF(AND($D$20=\"A\",MID($F166,1,1)<>\"A\"),0%,100%)","v":0},0,{"$f":"MAX(0,(V166+W166)-INDEX(CostoParametrico!$E$3:$L$18,MATCH($Y166,CostoParametrico!$D$3:$D$18,0),1)-AA166-AB166-AC166-AF166-AG166)*IF(AND($D$20=\"A\",MID($F166,1,1)<>\"A\"),0%,100%)","v":0},{"$f":"MAX(0,(V166+W166)-INDEX(CostoParametrico!$E$3:$L$18,MATCH($Y166,CostoParametrico!$D$3:$D$18,0),2)-AB166-AC166-AG166)*IF(AND($D$20=\"A\",MID(F166,1,1)<>\"A\"),0%,100%)","v":0},{"$f":"MAX(0,(V166+W166)-INDEX(CostoParametrico!$E$3:$L$18,MATCH($Y166,CostoParametrico!$D$3:$D$18,0),3)-AC166)*IF(AND($D$20=\"A\",MID(F166,1,1)<>\"A\"),0%,100%)","v":0},{"$f":"INDEX(CostoParametrico!$E$3:$L$18,MATCH($Y166,CostoParametrico!$D$3:$D$18,0),5)","v":400},{"$f":"INDEX(CostoParametrico!$E$3:$L$18,MATCH($Y166,CostoParametrico!$D$3:$D$18,0),6)","v":330},{"$f":"INDEX(CostoParametrico!$E$3:$L$18,MATCH($Y166,CostoParametrico!$D$3:$D$18,0),7)","v":300},{"$f":"INDEX(CostoParametrico!$E$3:$L$18,MATCH($Y166,CostoParametrico!$D$3:$D$18,0),8)","v":300},0,0,0,0,0,0,0,1,0,0,0,0,0,0,0,0,0,0,0,0,0,0,0,0,0,1.1000000000000001]
[1,1,26,1,"N","A - Abitativo",0,0,"Privata",10,"N",0,0,0,0,"N","N","L0",0,0,0,0,0,0,"Abitativa-L0",0,{"$f":"MAX(0,(V167)-INDEX(CostoParametrico!$E$3:$L$18,MATCH($Y167,CostoParametrico!$D$3:$D$18,0),1)-AB167-AC167)*IF(AND($D$20=\"A\",MID($F167,1,1)<>\"A\"),0%,100%)","v":0},{"$f":"MAX(0,(V167)-INDEX(CostoParametrico!$E$3:$L$18,MATCH($Y167,CostoParametrico!$D$3:$D$18,0),2)-AC167)*IF(AND($D$20=\"A\",MID($F167,1,1)<>\"A\"),0%,100%)","v":0},{"$f":"MAX(0,(V167)-INDEX(CostoParametrico!$E$3:$L$18,MATCH($Y167,CostoParametrico!$D$3:$D$18,0),3))*IF(AND($D$20=\"A\",MID($F167,1,1)<>\"A\"),0%,100%)","v":0},0,{"$f":"MAX(0,(V167+W167)-INDEX(CostoParametrico!$E$3:$L$18,MATCH($Y167,CostoParametrico!$D$3:$D$18,0),1)-AA167-AB167-AC167-AF167-AG167)*IF(AND($D$20=\"A\",MID($F167,1,1)<>\"A\"),0%,100%)","v":0},{"$f":"MAX(0,(V167+W167)-INDEX(CostoParametrico!$E$3:$L$18,MATCH($Y167,CostoParametrico!$D$3:$D$18,0),2)-AB167-AC167-AG167)*IF(AND($D$20=\"A\",MID(F167,1,1)<>\"A\"),0%,100%)","v":0},{"$f":"MAX(0,(V167+W167)-INDEX(CostoParametrico!$E$3:$L$18,MATCH($Y167,CostoParametrico!$D$3:$D$18,0),3)-AC167)*IF(AND($D$20=\"A\",MID(F167,1,1)<>\"A\"),0%,100%)","v":0},{"$f":"INDEX(CostoParametrico!$E$3:$L$18,MATCH($Y167,CostoParametrico!$D$3:$D$18,0),5)","v":400},{"$f":"INDEX(CostoParametrico!$E$3:$L$18,MATCH($Y167,CostoParametrico!$D$3:$D$18,0),6)","v":330},{"$f":"INDEX(CostoParametrico!$E$3:$L$18,MATCH($Y167,CostoParametrico!$D$3:$D$18,0),7)","v":300},{"$f":"INDEX(CostoParametrico!$E$3:$L$18,MATCH($Y167,CostoParametrico!$D$3:$D$18,0),8)","v":300},0,0,0,0,0,0,0,1,0,0,0,0,0,0,0,0,0,0,0,0,0,0,0,0,0,1.1000000000000001]
[1,1,27,1,"N","A - Abitativo",0,0,"Privata",10,"N",0,0,0,0,"N","N","L0",0,0,0,0,0,0,"Abitativa-L0",0,{"$f":"MAX(0,(V168)-INDEX(CostoParametrico!$E$3:$L$18,MATCH($Y168,CostoParametrico!$D$3:$D$18,0),1)-AB168-AC168)*IF(AND($D$20=\"A\",MID($F168,1,1)<>\"A\"),0%,100%)","v":0},{"$f":"MAX(0,(V168)-INDEX(CostoParametrico!$E$3:$L$18,MATCH($Y168,CostoParametrico!$D$3:$D$18,0),2)-AC168)*IF(AND($D$20=\"A\",MID($F168,1,1)<>\"A\"),0%,100%)","v":0},{"$f":"MAX(0,(V168)-INDEX(CostoParametrico!$E$3:$L$18,MATCH($Y168,CostoParametrico!$D$3:$D$18,0),3))*IF(AND($D$20=\"A\",MID($F168,1,1)<>\"A\"),0%,100%)","v":0},0,{"$f":"MAX(0,(V168+W168)-INDEX(CostoParametrico!$E$3:$L$18,MATCH($Y168,CostoParametrico!$D$3:$D$18,0),1)-AA168-AB168-AC168-AF168-AG168)*IF(AND($D$20=\"A\",MID($F168,1,1)<>\"A\"),0%,100%)","v":0},{"$f":"MAX(0,(V168+W168)-INDEX(CostoParametrico!$E$3:$L$18,MATCH($Y168,CostoParametrico!$D$3:$D$18,0),2)-AB168-AC168-AG168)*IF(AND($D$20=\"A\",MID(F168,1,1)<>\"A\"),0%,100%)","v":0},{"$f":"MAX(0,(V168+W168)-INDEX(CostoParametrico!$E$3:$L$18,MATCH($Y168,CostoParametrico!$D$3:$D$18,0),3)-AC168)*IF(AND($D$20=\"A\",MID(F168,1,1)<>\"A\"),0%,100%)","v":0},{"$f":"INDEX(CostoParametrico!$E$3:$L$18,MATCH($Y168,CostoParametrico!$D$3:$D$18,0),5)","v":400},{"$f":"INDEX(CostoParametrico!$E$3:$L$18,MATCH($Y168,CostoParametrico!$D$3:$D$18,0),6)","v":330},{"$f":"INDEX(CostoParametrico!$E$3:$L$18,MATCH($Y168,CostoParametrico!$D$3:$D$18,0),7)","v":300},{"$f":"INDEX(CostoParametrico!$E$3:$L$18,MATCH($Y168,CostoParametrico!$D$3:$D$18,0),8)","v":300},0,0,0,0,0,0,0,1,0,0,0,0,0,0,0,0,0,0,0,0,0,0,0,0,0,1.1000000000000001]
[1,1,28,1,"N","A - Abitativo",0,0,"Privata",10,"N",0,0,0,0,"N","N","L0",0,0,0,0,0,0,"Abitativa-L0",0,{"$f":"MAX(0,(V169)-INDEX(CostoParametrico!$E$3:$L$18,MATCH($Y169,CostoParametrico!$D$3:$D$18,0),1)-AB169-AC169)*IF(AND($D$20=\"A\",MID($F169,1,1)<>\"A\"),0%,100%)","v":0},{"$f":"MAX(0,(V169)-INDEX(CostoParametrico!$E$3:$L$18,MATCH($Y169,CostoParametrico!$D$3:$D$18,0),2)-AC169)*IF(AND($D$20=\"A\",MID($F169,1,1)<>\"A\"),0%,100%)","v":0},{"$f":"MAX(0,(V169)-INDEX(CostoParametrico!$E$3:$L$18,MATCH($Y169,CostoParametrico!$D$3:$D$18,0),3))*IF(AND($D$20=\"A\",MID($F169,1,1)<>\"A\"),0%,100%)","v":0},0,{"$f":"MAX(0,(V169+W169)-INDEX(CostoParametrico!$E$3:$L$18,MATCH($Y169,CostoParametrico!$D$3:$D$18,0),1)-AA169-AB169-AC169-AF169-AG169)*IF(AND($D$20=\"A\",MID($F169,1,1)<>\"A\"),0%,100%)","v":0},{"$f":"MAX(0,(V169+W169)-INDEX(CostoParametrico!$E$3:$L$18,MATCH($Y169,CostoParametrico!$D$3:$D$18,0),2)-AB169-AC169-AG169)*IF(AND($D$20=\"A\",MID(F169,1,1)<>\"A\"),0%,100%)","v":0},{"$f":"MAX(0,(V169+W169)-INDEX(CostoParametrico!$E$3:$L$18,MATCH($Y169,CostoParametrico!$D$3:$D$18,0),3)-AC169)*IF(AND($D$20=\"A\",MID(F169,1,1)<>\"A\"),0%,100%)","v":0},{"$f":"INDEX(CostoParametrico!$E$3:$L$18,MATCH($Y169,CostoParametrico!$D$3:$D$18,0),5)","v":400},{"$f":"INDEX(CostoParametrico!$E$3:$L$18,MATCH($Y169,CostoParametrico!$D$3:$D$18,0),6)","v":330},{"$f":"INDEX(CostoParametrico!$E$3:$L$18,MATCH($Y169,CostoParametrico!$D$3:$D$18,0),7)","v":300},{"$f":"INDEX(CostoParametrico!$E$3:$L$18,MATCH($Y169,CostoParametrico!$D$3:$D$18,0),8)","v":300},0,0,0,0,0,0,0,1,0,0,0,0,0,0,0,0,0,0,0,0,0,0,0,0,0,1.1000000000000001]
[1,1,29,1,"N","A - Abitativo",0,0,"Privata",10,"N",0,0,0,0,"N","N","L0",0,0,0,0,0,0,"Abitativa-L0",0,{"$f":"MAX(0,(V170)-INDEX(CostoParametrico!$E$3:$L$18,MATCH($Y170,CostoParametrico!$D$3:$D$18,0),1)-AB170-AC170)*IF(AND($D$20=\"A\",MID($F170,1,1)<>\"A\"),0%,100%)","v":0},{"$f":"MAX(0,(V170)-INDEX(CostoParametrico!$E$3:$L$18,MATCH($Y170,CostoParametrico!$D$3:$D$18,0),2)-AC170)*IF(AND($D$20=\"A\",MID($F170,1,1)<>\"A\"),0%,100%)","v":0},{"$f":"MAX(0,(V170)-INDEX(CostoParametrico!$E$3:$L$18,MATCH($Y170,CostoParametrico!$D$3:$D$18,0),3))*IF(AND($D$20=\"A\",MID($F170,1,1)<>\"A\"),0%,100%)","v":0},0,{"$f":"MAX(0,(V170+W170)-INDEX(CostoParametrico!$E$3:$L$18,MATCH($Y170,CostoParametrico!$D$3:$D$18,0),1)-AA170-AB170-AC170-AF170-AG170)*IF(AND($D$20=\"A\",MID($F170,1,1)<>\"A\"),0%,100%)","v":0},{"$f":"MAX(0,(V170+W170)-INDEX(CostoParametrico!$E$3:$L$18,MATCH($Y170,CostoParametrico!$D$3:$D$18,0),2)-AB170-AC170-AG170)*IF(AND($D$20=\"A\",MID(F170,1,1)<>\"A\"),0%,100%)","v":0},{"$f":"MAX(0,(V170+W170)-INDEX(CostoParametrico!$E$3:$L$18,MATCH($Y170,CostoParametrico!$D$3:$D$18,0),3)-AC170)*IF(AND($D$20=\"A\",MID(F170,1,1)<>\"A\"),0%,100%)","v":0},{"$f":"INDEX(CostoParametrico!$E$3:$L$18,MATCH($Y170,CostoParametrico!$D$3:$D$18,0),5)","v":400},{"$f":"INDEX(CostoParametrico!$E$3:$L$18,MATCH($Y170,CostoParametrico!$D$3:$D$18,0),6)","v":330},{"$f":"INDEX(CostoParametrico!$E$3:$L$18,MATCH($Y170,CostoParametrico!$D$3:$D$18,0),7)","v":300},{"$f":"INDEX(CostoParametrico!$E$3:$L$18,MATCH($Y170,CostoParametrico!$D$3:$D$18,0),8)","v":300},0,0,0,0,0,0,0,1,0,0,0,0,0,0,0,0,0,0,0,0,0,0,0,0,0,1.1000000000000001]
[1,1,30,1,"N","A - Abitativo",0,0,"Privata",10,"N",0,0,0,0,"N","N","L0",0,0,0,0,0,0,"Abitativa-L0",0,{"$f":"MAX(0,(V171)-INDEX(CostoParametrico!$E$3:$L$18,MATCH($Y171,CostoParametrico!$D$3:$D$18,0),1)-AB171-AC171)*IF(AND($D$20=\"A\",MID($F171,1,1)<>\"A\"),0%,100%)","v":0},{"$f":"MAX(0,(V171)-INDEX(CostoParametrico!$E$3:$L$18,MATCH($Y171,CostoParametrico!$D$3:$D$18,0),2)-AC171)*IF(AND($D$20=\"A\",MID($F171,1,1)<>\"A\"),0%,100%)","v":0},{"$f":"MAX(0,(V171)-INDEX(CostoParametrico!$E$3:$L$18,MATCH($Y171,CostoParametrico!$D$3:$D$18,0),3))*IF(AND($D$20=\"A\",MID($F171,1,1)<>\"A\"),0%,100%)","v":0},0,{"$f":"MAX(0,(V171+W171)-INDEX(CostoParametrico!$E$3:$L$18,MATCH($Y171,CostoParametrico!$D$3:$D$18,0),1)-AA171-AB171-AC171-AF171-AG171)*IF(AND($D$20=\"A\",MID($F171,1,1)<>\"A\"),0%,100%)","v":0},{"$f":"MAX(0,(V171+W171)-INDEX(CostoParametrico!$E$3:$L$18,MATCH($Y171,CostoParametrico!$D$3:$D$18,0),2)-AB171-AC171-AG171)*IF(AND($D$20=\"A\",MID(F171,1,1)<>\"A\"),0%,100%)","v":0},{"$f":"MAX(0,(V171+W171)-INDEX(CostoParametrico!$E$3:$L$18,MATCH($Y171,CostoParametrico!$D$3:$D$18,0),3)-AC171)*IF(AND($D$20=\"A\",MID(F171,1,1)<>\"A\"),0%,100%)","v":0},{"$f":"INDEX(CostoParametrico!$E$3:$L$18,MATCH($Y171,CostoParametrico!$D$3:$D$18,0),5)","v":400},{"$f":"INDEX(CostoParametrico!$E$3:$L$18,MATCH($Y171,CostoParametrico!$D$3:$D$18,0),6)","v":330},{"$f":"INDEX(CostoParametrico!$E$3:$L$18,MATCH($Y171,CostoParametrico!$D$3:$D$18,0),7)","v":300},{"$f":"INDEX(CostoParametrico!$E$3:$L$18,MATCH($Y171,CostoParametrico!$D$3:$D$18,0),8)","v":300},0,0,0,0,0,0,0,1,0,0,0,0,0,0,0,0,0,0,0,0,0,0,0,0,0,1.1000000000000001]
[1,1,31,1,"N","A - Abitativo",0,0,"Privata",10,"N",0,0,0,0,"N","N","L0",0,0,0,0,0,0,"Abitativa-L0",0,{"$f":"MAX(0,(V172)-INDEX(CostoParametrico!$E$3:$L$18,MATCH($Y172,CostoParametrico!$D$3:$D$18,0),1)-AB172-AC172)*IF(AND($D$20=\"A\",MID($F172,1,1)<>\"A\"),0%,100%)","v":0},{"$f":"MAX(0,(V172)-INDEX(CostoParametrico!$E$3:$L$18,MATCH($Y172,CostoParametrico!$D$3:$D$18,0),2)-AC172)*IF(AND($D$20=\"A\",MID($F172,1,1)<>\"A\"),0%,100%)","v":0},{"$f":"MAX(0,(V172)-INDEX(CostoParametrico!$E$3:$L$18,MATCH($Y172,CostoParametrico!$D$3:$D$18,0),3))*IF(AND($D$20=\"A\",MID($F172,1,1)<>\"A\"),0%,100%)","v":0},0,{"$f":"MAX(0,(V172+W172)-INDEX(CostoParametrico!$E$3:$L$18,MATCH($Y172,CostoParametrico!$D$3:$D$18,0),1)-AA172-AB172-AC172-AF172-AG172)*IF(AND($D$20=\"A\",MID($F172,1,1)<>\"A\"),0%,100%)","v":0},{"$f":"MAX(0,(V172+W172)-INDEX(CostoParametrico!$E$3:$L$18,MATCH($Y172,CostoParametrico!$D$3:$D$18,0),2)-AB172-AC172-AG172)*IF(AND($D$20=\"A\",MID(F172,1,1)<>\"A\"),0%,100%)","v":0},{"$f":"MAX(0,(V172+W172)-INDEX(CostoParametrico!$E$3:$L$18,MATCH($Y172,CostoParametrico!$D$3:$D$18,0),3)-AC172)*IF(AND($D$20=\"A\",MID(F172,1,1)<>\"A\"),0%,100%)","v":0},{"$f":"INDEX(CostoParametrico!$E$3:$L$18,MATCH($Y172,CostoParametrico!$D$3:$D$18,0),5)","v":400},{"$f":"INDEX(CostoParametrico!$E$3:$L$18,MATCH($Y172,CostoParametrico!$D$3:$D$18,0),6)","v":330},{"$f":"INDEX(CostoParametrico!$E$3:$L$18,MATCH($Y172,CostoParametrico!$D$3:$D$18,0),7)","v":300},{"$f":"INDEX(CostoParametrico!$E$3:$L$18,MATCH($Y172,CostoParametrico!$D$3:$D$18,0),8)","v":300},0,0,0,0,0,0,0,1,0,0,0,0,0,0,0,0,0,0,0,0,0,0,0,0,0,1.1000000000000001]
[1,1,32,1,"N","A - Abitativo",0,0,"Privata",10,"N",0,0,0,0,"N","N","L0",0,0,0,0,0,0,"Abitativa-L0",0,{"$f":"MAX(0,(V173)-INDEX(CostoParametrico!$E$3:$L$18,MATCH($Y173,CostoParametrico!$D$3:$D$18,0),1)-AB173-AC173)*IF(AND($D$20=\"A\",MID($F173,1,1)<>\"A\"),0%,100%)","v":0},{"$f":"MAX(0,(V173)-INDEX(CostoParametrico!$E$3:$L$18,MATCH($Y173,CostoParametrico!$D$3:$D$18,0),2)-AC173)*IF(AND($D$20=\"A\",MID($F173,1,1)<>\"A\"),0%,100%)","v":0},{"$f":"MAX(0,(V173)-INDEX(CostoParametrico!$E$3:$L$18,MATCH($Y173,CostoParametrico!$D$3:$D$18,0),3))*IF(AND($D$20=\"A\",MID($F173,1,1)<>\"A\"),0%,100%)","v":0},0,{"$f":"MAX(0,(V173+W173)-INDEX(CostoParametrico!$E$3:$L$18,MATCH($Y173,CostoParametrico!$D$3:$D$18,0),1)-AA173-AB173-AC173-AF173-AG173)*IF(AND($D$20=\"A\",MID($F173,1,1)<>\"A\"),0%,100%)","v":0},{"$f":"MAX(0,(V173+W173)-INDEX(CostoParametrico!$E$3:$L$18,MATCH($Y173,CostoParametrico!$D$3:$D$18,0),2)-AB173-AC173-AG173)*IF(AND($D$20=\"A\",MID(F173,1,1)<>\"A\"),0%,100%)","v":0},{"$f":"MAX(0,(V173+W173)-INDEX(CostoParametrico!$E$3:$L$18,MATCH($Y173,CostoParametrico!$D$3:$D$18,0),3)-AC173)*IF(AND($D$20=\"A\",MID(F173,1,1)<>\"A\"),0%,100%)","v":0},{"$f":"INDEX(CostoParametrico!$E$3:$L$18,MATCH($Y173,CostoParametrico!$D$3:$D$18,0),5)","v":400},{"$f":"INDEX(CostoParametrico!$E$3:$L$18,MATCH($Y173,CostoParametrico!$D$3:$D$18,0),6)","v":330},{"$f":"INDEX(CostoParametrico!$E$3:$L$18,MATCH($Y173,CostoParametrico!$D$3:$D$18,0),7)","v":300},{"$f":"INDEX(CostoParametrico!$E$3:$L$18,MATCH($Y173,CostoParametrico!$D$3:$D$18,0),8)","v":300},0,0,0,0,0,0,0,1,0,0,0,0,0,0,0,0,0,0,0,0,0,0,0,0,0,1.1000000000000001]
[{"$f":"IF($E174=\"S\",I$9,I$10)","v":1},{"$f":"IF($E174=\"S\",J$9,J$10)","v":1},33,1,"N","A - Abitativo",0,0,"Privata",10,"N",0,0,0,0,"N","N","L0",0,0,0,{"$f":"SUM(L174:M174,O174)","v":0},{"$f":"MIN(70%*L174,N174)","v":0},0,{"$f":"IF($D$22=\"DC\",$F$22,$E$20&\"-\"&R174)","v":"Abitativa-L0"},0,{"$f":"MAX(0,(V174)-INDEX(CostoParametrico!$E$3:$L$18,MATCH($Y174,CostoParametrico!$D$3:$D$18,0),1)-AB174-AC174)*IF(AND($D$20=\"A\",MID($F174,1,1)<>\"A\"),0%,100%)","v":0},{"$f":"MAX(0,(V174)-INDEX(CostoParametrico!$E$3:$L$18,MATCH($Y174,CostoParametrico!$D$3:$D$18,0),2)-AC174)*IF(AND($D$20=\"A\",MID($F174,1,1)<>\"A\"),0%,100%)","v":0},{"$f":"MAX(0,(V174)-INDEX(CostoParametrico!$E$3:$L$18,MATCH($Y174,CostoParametrico!$D$3:$D$18,0),3))*IF(AND($D$20=\"A\",MID($F174,1,1)<>\"A\"),0%,100%)","v":0},0,{"$f":"MAX(0,(V174+W174)-INDEX(CostoParametrico!$E$3:$L$18,MATCH($Y174,CostoParametrico!$D$3:$D$18,0),1)-AA174-AB174-AC174-AF174-AG174)*IF(AND($D$20=\"A\",MID($F174,1,1)<>\"A\"),0%,100%)","v":0},{"$f":"MAX(0,(V174+W174)-INDEX(CostoParametrico!$E$3:$L$18,MATCH($Y174,CostoParametrico!$D$3:$D$18,0),2)-AB174-AC174-AG174)*IF(AND($D$20=\"A\",MID(F174,1,1)<>\"A\"),0%,100%)","v":0},{"$f":"MAX(0,(V174+W174)-INDEX(CostoParametrico!$E$3:$L$18,MATCH($Y174,CostoParametrico!$D$3:$D$18,0),3)-AC174)*IF(AND($D$20=\"A\",MID(F174,1,1)<>\"A\"),0%,100%)","v":0},{"$f":"INDEX(CostoParametrico!$E$3:$L$18,MATCH($Y174,CostoParametrico!$D$3:$D$18,0),5)","v":400},{"$f":"INDEX(CostoParametrico!$E$3:$L$18,MATCH($Y174,CostoParametrico!$D$3:$D$18,0),6)","v":330},{"$f":"INDEX(CostoParametrico!$E$3:$L$18,MATCH($Y174,CostoParametrico!$D$3:$D$18,0),7)","v":300},{"$f":"INDEX(CostoParametrico!$E$3:$L$18,MATCH($Y174,CostoParametrico!$D$3:$D$18,0),8)","v":300},0,0,0,0,0,0,0,1,0,0,0,0,0,0,0,0,0,0,0,0,0,0,0,0,0,1.1000000000000001]
[1,1,34,1,"N","A - Abitativo",0,0,"Privata",10,"N",0,0,0,0,"N","N","L0",0,0,0,0,0,0,"Abitativa-L0",0,{"$f":"MAX(0,(V175)-INDEX(CostoParametrico!$E$3:$L$18,MATCH($Y175,CostoParametrico!$D$3:$D$18,0),1)-AB175-AC175)*IF(AND($D$20=\"A\",MID($F175,1,1)<>\"A\"),0%,100%)","v":0},{"$f":"MAX(0,(V175)-INDEX(CostoParametrico!$E$3:$L$18,MATCH($Y175,CostoParametrico!$D$3:$D$18,0),2)-AC175)*IF(AND($D$20=\"A\",MID($F175,1,1)<>\"A\"),0%,100%)","v":0},{"$f":"MAX(0,(V175)-INDEX(CostoParametrico!$E$3:$L$18,MATCH($Y175,CostoParametrico!$D$3:$D$18,0),3))*IF(AND($D$20=\"A\",MID($F175,1,1)<>\"A\"),0%,100%)","v":0},0,{"$f":"MAX(0,(V175+W175)-INDEX(CostoParametrico!$E$3:$L$18,MATCH($Y175,CostoParametrico!$D$3:$D$18,0),1)-AA175-AB175-AC175-AF175-AG175)*IF(AND($D$20=\"A\",MID($F175,1,1)<>\"A\"),0%,100%)","v":0},{"$f":"MAX(0,(V175+W175)-INDEX(CostoParametrico!$E$3:$L$18,MATCH($Y175,CostoParametrico!$D$3:$D$18,0),2)-AB175-AC175-AG175)*IF(AND($D$20=\"A\",MID(F175,1,1)<>\"A\"),0%,100%)","v":0},{"$f":"MAX(0,(V175+W175)-INDEX(CostoParametrico!$E$3:$L$18,MATCH($Y175,CostoParametrico!$D$3:$D$18,0),3)-AC175)*IF(AND($D$20=\"A\",MID(F175,1,1)<>\"A\"),0%,100%)","v":0},{"$f":"INDEX(CostoParametrico!$E$3:$L$18,MATCH($Y175,CostoParametrico!$D$3:$D$18,0),5)","v":400},{"$f":"INDEX(CostoParametrico!$E$3:$L$18,MATCH($Y175,CostoParametrico!$D$3:$D$18,0),6)","v":330},{"$f":"INDEX(CostoParametrico!$E$3:$L$18,MATCH($Y175,CostoParametrico!$D$3:$D$18,0),7)","v":300},{"$f":"INDEX(CostoParametrico!$E$3:$L$18,MATCH($Y175,CostoParametrico!$D$3:$D$18,0),8)","v":300},0,0,0,0,0,0,0,1,0,0,0,0,0,0,0,0,0,0,0,0,0,0,0,0,0,1.1000000000000001]
[1,1,35,1,"N","A - Abitativo",0,0,"Privata",10,"N",0,0,0,0,"N","N","L0",0,0,0,0,0,0,"Abitativa-L0",0,{"$f":"MAX(0,(V176)-INDEX(CostoParametrico!$E$3:$L$18,MATCH($Y176,CostoParametrico!$D$3:$D$18,0),1)-AB176-AC176)*IF(AND($D$20=\"A\",MID($F176,1,1)<>\"A\"),0%,100%)","v":0},{"$f":"MAX(0,(V176)-INDEX(CostoParametrico!$E$3:$L$18,MATCH($Y176,CostoParametrico!$D$3:$D$18,0),2)-AC176)*IF(AND($D$20=\"A\",MID($F176,1,1)<>\"A\"),0%,100%)","v":0},{"$f":"MAX(0,(V176)-INDEX(CostoParametrico!$E$3:$L$18,MATCH($Y176,CostoParametrico!$D$3:$D$18,0),3))*IF(AND($D$20=\"A\",MID($F176,1,1)<>\"A\"),0%,100%)","v":0},0,{"$f":"MAX(0,(V176+W176)-INDEX(CostoParametrico!$E$3:$L$18,MATCH($Y176,CostoParametrico!$D$3:$D$18,0),1)-AA176-AB176-AC176-AF176-AG176)*IF(AND($D$20=\"A\",MID($F176,1,1)<>\"A\"),0%,100%)","v":0},{"$f":"MAX(0,(V176+W176)-INDEX(CostoParametrico!$E$3:$L$18,MATCH($Y176,CostoParametrico!$D$3:$D$18,0),2)-AB176-AC176-AG176)*IF(AND($D$20=\"A\",MID(F176,1,1)<>\"A\"),0%,100%)","v":0},{"$f":"MAX(0,(V176+W176)-INDEX(CostoParametrico!$E$3:$L$18,MATCH($Y176,CostoParametrico!$D$3:$D$18,0),3)-AC176)*IF(AND($D$20=\"A\",MID(F176,1,1)<>\"A\"),0%,100%)","v":0},{"$f":"INDEX(CostoParametrico!$E$3:$L$18,MATCH($Y176,CostoParametrico!$D$3:$D$18,0),5)","v":400},{"$f":"INDEX(CostoParametrico!$E$3:$L$18,MATCH($Y176,CostoParametrico!$D$3:$D$18,0),6)","v":330},{"$f":"INDEX(CostoParametrico!$E$3:$L$18,MATCH($Y176,CostoParametrico!$D$3:$D$18,0),7)","v":300},{"$f":"INDEX(CostoParametrico!$E$3:$L$18,MATCH($Y176,CostoParametrico!$D$3:$D$18,0),8)","v":300},0,0,0,0,0,0,0,1,0,0,0,0,0,0,0,0,0,0,0,0,0,0,0,0,0,1.1000000000000001]
[1,1,36,1,"N","A - Abitativo",0,0,"Privata",10,"N",0,0,0,0,"N","N","L0",0,0,0,0,0,0,"Abitativa-L0",0,{"$f":"MAX(0,(V177)-INDEX(CostoParametrico!$E$3:$L$18,MATCH($Y177,CostoParametrico!$D$3:$D$18,0),1)-AB177-AC177)*IF(AND($D$20=\"A\",MID($F177,1,1)<>\"A\"),0%,100%)","v":0},{"$f":"MAX(0,(V177)-INDEX(CostoParametrico!$E$3:$L$18,MATCH($Y177,CostoParametrico!$D$3:$D$18,0),2)-AC177)*IF(AND($D$20=\"A\",MID($F177,1,1)<>\"A\"),0%,100%)","v":0},{"$f":"MAX(0,(V177)-INDEX(CostoParametrico!$E$3:$L$18,MATCH($Y177,CostoParametrico!$D$3:$D$18,0),3))*IF(AND($D$20=\"A\",MID($F177,1,1)<>\"A\"),0%,100%)","v":0},0,{"$f":"MAX(0,(V177+W177)-INDEX(CostoParametrico!$E$3:$L$18,MATCH($Y177,CostoParametrico!$D$3:$D$18,0),1)-AA177-AB177-AC177-AF177-AG177)*IF(AND($D$20=\"A\",MID($F177,1,1)<>\"A\"),0%,100%)","v":0},{"$f":"MAX(0,(V177+W177)-INDEX(CostoParametrico!$E$3:$L$18,MATCH($Y177,CostoParametrico!$D$3:$D$18,0),2)-AB177-AC177-AG177)*IF(AND($D$20=\"A\",MID(F177,1,1)<>\"A\"),0%,100%)","v":0},{"$f":"MAX(0,(V177+W177)-INDEX(CostoParametrico!$E$3:$L$18,MATCH($Y177,CostoParametrico!$D$3:$D$18,0),3)-AC177)*IF(AND($D$20=\"A\",MID(F177,1,1)<>\"A\"),0%,100%)","v":0},{"$f":"INDEX(CostoParametrico!$E$3:$L$18,MATCH($Y177,CostoParametrico!$D$3:$D$18,0),5)","v":400},{"$f":"INDEX(CostoParametrico!$E$3:$L$18,MATCH($Y177,CostoParametrico!$D$3:$D$18,0),6)","v":330},{"$f":"INDEX(CostoParametrico!$E$3:$L$18,MATCH($Y177,CostoParametrico!$D$3:$D$18,0),7)","v":300},{"$f":"INDEX(CostoParametrico!$E$3:$L$18,MATCH($Y177,CostoParametrico!$D$3:$D$18,0),8)","v":300},0,0,0,0,0,0,0,1,0,0,0,0,0,0,0,0,0,0,0,0,0,0,0,0,0,1.1000000000000001]
[1,1,37,1,"N","A - Abitativo",0,0,"Privata",10,"N",0,0,0,0,"N","N","L0",0,0,0,0,0,0,"Abitativa-L0",0,{"$f":"MAX(0,(V178)-INDEX(CostoParametrico!$E$3:$L$18,MATCH($Y178,CostoParametrico!$D$3:$D$18,0),1)-AB178-AC178)*IF(AND($D$20=\"A\",MID($F178,1,1)<>\"A\"),0%,100%)","v":0},{"$f":"MAX(0,(V178)-INDEX(CostoParametrico!$E$3:$L$18,MATCH($Y178,CostoParametrico!$D$3:$D$18,0),2)-AC178)*IF(AND($D$20=\"A\",MID($F178,1,1)<>\"A\"),0%,100%)","v":0},{"$f":"MAX(0,(V178)-INDEX(CostoParametrico!$E$3:$L$18,MATCH($Y178,CostoParametrico!$D$3:$D$18,0),3))*IF(AND($D$20=\"A\",MID($F178,1,1)<>\"A\"),0%,100%)","v":0},0,{"$f":"MAX(0,(V178+W178)-INDEX(CostoParametrico!$E$3:$L$18,MATCH($Y178,CostoParametrico!$D$3:$D$18,0),1)-AA178-AB178-AC178-AF178-AG178)*IF(AND($D$20=\"A\",MID($F178,1,1)<>\"A\"),0%,100%)","v":0},{"$f":"MAX(0,(V178+W178)-INDEX(CostoParametrico!$E$3:$L$18,MATCH($Y178,CostoParametrico!$D$3:$D$18,0),2)-AB178-AC178-AG178)*IF(AND($D$20=\"A\",MID(F178,1,1)<>\"A\"),0%,100%)","v":0},{"$f":"MAX(0,(V178+W178)-INDEX(CostoParametrico!$E$3:$L$18,MATCH($Y178,CostoParametrico!$D$3:$D$18,0),3)-AC178)*IF(AND($D$20=\"A\",MID(F178,1,1)<>\"A\"),0%,100%)","v":0},{"$f":"INDEX(CostoParametrico!$E$3:$L$18,MATCH($Y178,CostoParametrico!$D$3:$D$18,0),5)","v":400},{"$f":"INDEX(CostoParametrico!$E$3:$L$18,MATCH($Y178,CostoParametrico!$D$3:$D$18,0),6)","v":330},{"$f":"INDEX(CostoParametrico!$E$3:$L$18,MATCH($Y178,CostoParametrico!$D$3:$D$18,0),7)","v":300},{"$f":"INDEX(CostoParametrico!$E$3:$L$18,MATCH($Y178,CostoParametrico!$D$3:$D$18,0),8)","v":300},0,0,0,0,0,0,0,1,0,0,0,0,0,0,0,0,0,0,0,0,0,0,0,0,0,1.1000000000000001]
[1,1,38,1,"N","A - Abitativo",0,0,"Privata",10,"N",0,0,0,0,"N","N","L0",0,0,0,0,0,0,"Abitativa-L0",0,{"$f":"MAX(0,(V179)-INDEX(CostoParametrico!$E$3:$L$18,MATCH($Y179,CostoParametrico!$D$3:$D$18,0),1)-AB179-AC179)*IF(AND($D$20=\"A\",MID($F179,1,1)<>\"A\"),0%,100%)","v":0},{"$f":"MAX(0,(V179)-INDEX(CostoParametrico!$E$3:$L$18,MATCH($Y179,CostoParametrico!$D$3:$D$18,0),2)-AC179)*IF(AND($D$20=\"A\",MID($F179,1,1)<>\"A\"),0%,100%)","v":0},{"$f":"MAX(0,(V179)-INDEX(CostoParametrico!$E$3:$L$18,MATCH($Y179,CostoParametrico!$D$3:$D$18,0),3))*IF(AND($D$20=\"A\",MID($F179,1,1)<>\"A\"),0%,100%)","v":0},0,{"$f":"MAX(0,(V179+W179)-INDEX(CostoParametrico!$E$3:$L$18,MATCH($Y179,CostoParametrico!$D$3:$D$18,0),1)-AA179-AB179-AC179-AF179-AG179)*IF(AND($D$20=\"A\",MID($F179,1,1)<>\"A\"),0%,100%)","v":0},{"$f":"MAX(0,(V179+W179)-INDEX(CostoParametrico!$E$3:$L$18,MATCH($Y179,CostoParametrico!$D$3:$D$18,0),2)-AB179-AC179-AG179)*IF(AND($D$20=\"A\",MID(F179,1,1)<>\"A\"),0%,100%)","v":0},{"$f":"MAX(0,(V179+W179)-INDEX(CostoParametrico!$E$3:$L$18,MATCH($Y179,CostoParametrico!$D$3:$D$18,0),3)-AC179)*IF(AND($D$20=\"A\",MID(F179,1,1)<>\"A\"),0%,100%)","v":0},{"$f":"INDEX(CostoParametrico!$E$3:$L$18,MATCH($Y179,CostoParametrico!$D$3:$D$18,0),5)","v":400},{"$f":"INDEX(CostoParametrico!$E$3:$L$18,MATCH($Y179,CostoParametrico!$D$3:$D$18,0),6)","v":330},{"$f":"INDEX(CostoParametrico!$E$3:$L$18,MATCH($Y179,CostoParametrico!$D$3:$D$18,0),7)","v":300},{"$f":"INDEX(CostoParametrico!$E$3:$L$18,MATCH($Y179,CostoParametrico!$D$3:$D$18,0),8)","v":300},0,0,0,0,0,0,0,1,0,0,0,0,0,0,0,0,0,0,0,0,0,0,0,0,0,1.1000000000000001]
[1,1,39,1,"N","A - Abitativo",0,0,"Privata",10,"N",0,0,0,0,"N","N","L0",0,0,0,0,0,0,"Abitativa-L0",0,{"$f":"MAX(0,(V180)-INDEX(CostoParametrico!$E$3:$L$18,MATCH($Y180,CostoParametrico!$D$3:$D$18,0),1)-AB180-AC180)*IF(AND($D$20=\"A\",MID($F180,1,1)<>\"A\"),0%,100%)","v":0},{"$f":"MAX(0,(V180)-INDEX(CostoParametrico!$E$3:$L$18,MATCH($Y180,CostoParametrico!$D$3:$D$18,0),2)-AC180)*IF(AND($D$20=\"A\",MID($F180,1,1)<>\"A\"),0%,100%)","v":0},{"$f":"MAX(0,(V180)-INDEX(CostoParametrico!$E$3:$L$18,MATCH($Y180,CostoParametrico!$D$3:$D$18,0),3))*IF(AND($D$20=\"A\",MID($F180,1,1)<>\"A\"),0%,100%)","v":0},0,{"$f":"MAX(0,(V180+W180)-INDEX(CostoParametrico!$E$3:$L$18,MATCH($Y180,CostoParametrico!$D$3:$D$18,0),1)-AA180-AB180-AC180-AF180-AG180)*IF(AND($D$20=\"A\",MID($F180,1,1)<>\"A\"),0%,100%)","v":0},{"$f":"MAX(0,(V180+W180)-INDEX(CostoParametrico!$E$3:$L$18,MATCH($Y180,CostoParametrico!$D$3:$D$18,0),2)-AB180-AC180-AG180)*IF(AND($D$20=\"A\",MID(F180,1,1)<>\"A\"),0%,100%)","v":0},{"$f":"MAX(0,(V180+W180)-INDEX(CostoParametrico!$E$3:$L$18,MATCH($Y180,CostoParametrico!$D$3:$D$18,0),3)-AC180)*IF(AND($D$20=\"A\",MID(F180,1,1)<>\"A\"),0%,100%)","v":0},{"$f":"INDEX(CostoParametrico!$E$3:$L$18,MATCH($Y180,CostoParametrico!$D$3:$D$18,0),5)","v":400},{"$f":"INDEX(CostoParametrico!$E$3:$L$18,MATCH($Y180,CostoParametrico!$D$3:$D$18,0),6)","v":330},{"$f":"INDEX(CostoParametrico!$E$3:$L$18,MATCH($Y180,CostoParametrico!$D$3:$D$18,0),7)","v":300},{"$f":"INDEX(CostoParametrico!$E$3:$L$18,MATCH($Y180,CostoParametrico!$D$3:$D$18,0),8)","v":300},0,0,0,0,0,0,0,1,0,0,0,0,0,0,0,0,0,0,0,0,0,0,0,0,0,1.1000000000000001]
[1,1,40,1,"N","A - Abitativo",0,0,"Privata",10,"N",0,0,0,0,"N","N","L0",0,0,0,0,0,0,"Abitativa-L0",0,{"$f":"MAX(0,(V181)-INDEX(CostoParametrico!$E$3:$L$18,MATCH($Y181,CostoParametrico!$D$3:$D$18,0),1)-AB181-AC181)*IF(AND($D$20=\"A\",MID($F181,1,1)<>\"A\"),0%,100%)","v":0},{"$f":"MAX(0,(V181)-INDEX(CostoParametrico!$E$3:$L$18,MATCH($Y181,CostoParametrico!$D$3:$D$18,0),2)-AC181)*IF(AND($D$20=\"A\",MID($F181,1,1)<>\"A\"),0%,100%)","v":0},{"$f":"MAX(0,(V181)-INDEX(CostoParametrico!$E$3:$L$18,MATCH($Y181,CostoParametrico!$D$3:$D$18,0),3))*IF(AND($D$20=\"A\",MID($F181,1,1)<>\"A\"),0%,100%)","v":0},0,{"$f":"MAX(0,(V181+W181)-INDEX(CostoParametrico!$E$3:$L$18,MATCH($Y181,CostoParametrico!$D$3:$D$18,0),1)-AA181-AB181-AC181-AF181-AG181)*IF(AND($D$20=\"A\",MID($F181,1,1)<>\"A\"),0%,100%)","v":0},{"$f":"MAX(0,(V181+W181)-INDEX(CostoParametrico!$E$3:$L$18,MATCH($Y181,CostoParametrico!$D$3:$D$18,0),2)-AB181-AC181-AG181)*IF(AND($D$20=\"A\",MID(F181,1,1)<>\"A\"),0%,100%)","v":0},{"$f":"MAX(0,(V181+W181)-INDEX(CostoParametrico!$E$3:$L$18,MATCH($Y181,CostoParametrico!$D$3:$D$18,0),3)-AC181)*IF(AND($D$20=\"A\",MID(F181,1,1)<>\"A\"),0%,100%)","v":0},{"$f":"INDEX(CostoParametrico!$E$3:$L$18,MATCH($Y181,CostoParametrico!$D$3:$D$18,0),5)","v":400},{"$f":"INDEX(CostoParametrico!$E$3:$L$18,MATCH($Y181,CostoParametrico!$D$3:$D$18,0),6)","v":330},{"$f":"INDEX(CostoParametrico!$E$3:$L$18,MATCH($Y181,CostoParametrico!$D$3:$D$18,0),7)","v":300},{"$f":"INDEX(CostoParametrico!$E$3:$L$18,MATCH($Y181,CostoParametrico!$D$3:$D$18,0),8)","v":300},0,0,0,0,0,0,0,1,0,0,0,0,0,0,0,0,0,0,0,0,0,0,0,0,0,1.1000000000000001]
[1,1,41,1,"N","A - Abitativo",0,0,"Privata",10,"N",0,0,0,0,"N","N","L0",0,0,0,0,0,0,"Abitativa-L0",0,{"$f":"MAX(0,(V182)-INDEX(CostoParametrico!$E$3:$L$18,MATCH($Y182,CostoParametrico!$D$3:$D$18,0),1)-AB182-AC182)*IF(AND($D$20=\"A\",MID($F182,1,1)<>\"A\"),0%,100%)","v":0},{"$f":"MAX(0,(V182)-INDEX(CostoParametrico!$E$3:$L$18,MATCH($Y182,CostoParametrico!$D$3:$D$18,0),2)-AC182)*IF(AND($D$20=\"A\",MID($F182,1,1)<>\"A\"),0%,100%)","v":0},{"$f":"MAX(0,(V182)-INDEX(CostoParametrico!$E$3:$L$18,MATCH($Y182,CostoParametrico!$D$3:$D$18,0),3))*IF(AND($D$20=\"A\",MID($F182,1,1)<>\"A\"),0%,100%)","v":0},0,{"$f":"MAX(0,(V182+W182)-INDEX(CostoParametrico!$E$3:$L$18,MATCH($Y182,CostoParametrico!$D$3:$D$18,0),1)-AA182-AB182-AC182-AF182-AG182)*IF(AND($D$20=\"A\",MID($F182,1,1)<>\"A\"),0%,100%)","v":0},{"$f":"MAX(0,(V182+W182)-INDEX(CostoParametrico!$E$3:$L$18,MATCH($Y182,CostoParametrico!$D$3:$D$18,0),2)-AB182-AC182-AG182)*IF(AND($D$20=\"A\",MID(F182,1,1)<>\"A\"),0%,100%)","v":0},{"$f":"MAX(0,(V182+W182)-INDEX(CostoParametrico!$E$3:$L$18,MATCH($Y182,CostoParametrico!$D$3:$D$18,0),3)-AC182)*IF(AND($D$20=\"A\",MID(F182,1,1)<>\"A\"),0%,100%)","v":0},{"$f":"INDEX(CostoParametrico!$E$3:$L$18,MATCH($Y182,CostoParametrico!$D$3:$D$18,0),5)","v":400},{"$f":"INDEX(CostoParametrico!$E$3:$L$18,MATCH($Y182,CostoParametrico!$D$3:$D$18,0),6)","v":330},{"$f":"INDEX(CostoParametrico!$E$3:$L$18,MATCH($Y182,CostoParametrico!$D$3:$D$18,0),7)","v":300},{"$f":"INDEX(CostoParametrico!$E$3:$L$18,MATCH($Y182,CostoParametrico!$D$3:$D$18,0),8)","v":300},0,0,0,0,0,0,0,1,0,0,0,0,0,0,0,0,0,0,0,0,0,0,0,0,0,1.1000000000000001]
[1,1,42,1,"N","A - Abitativo",0,0,"Privata",10,"N",0,0,0,0,"N","N","L0",0,0,0,0,0,0,"Abitativa-L0",0,{"$f":"MAX(0,(V183)-INDEX(CostoParametrico!$E$3:$L$18,MATCH($Y183,CostoParametrico!$D$3:$D$18,0),1)-AB183-AC183)*IF(AND($D$20=\"A\",MID($F183,1,1)<>\"A\"),0%,100%)","v":0},{"$f":"MAX(0,(V183)-INDEX(CostoParametrico!$E$3:$L$18,MATCH($Y183,CostoParametrico!$D$3:$D$18,0),2)-AC183)*IF(AND($D$20=\"A\",MID($F183,1,1)<>\"A\"),0%,100%)","v":0},{"$f":"MAX(0,(V183)-INDEX(CostoParametrico!$E$3:$L$18,MATCH($Y183,CostoParametrico!$D$3:$D$18,0),3))*IF(AND($D$20=\"A\",MID($F183,1,1)<>\"A\"),0%,100%)","v":0},0,{"$f":"MAX(0,(V183+W183)-INDEX(CostoParametrico!$E$3:$L$18,MATCH($Y183,CostoParametrico!$D$3:$D$18,0),1)-AA183-AB183-AC183-AF183-AG183)*IF(AND($D$20=\"A\",MID($F183,1,1)<>\"A\"),0%,100%)","v":0},{"$f":"MAX(0,(V183+W183)-INDEX(CostoParametrico!$E$3:$L$18,MATCH($Y183,CostoParametrico!$D$3:$D$18,0),2)-AB183-AC183-AG183)*IF(AND($D$20=\"A\",MID(F183,1,1)<>\"A\"),0%,100%)","v":0},{"$f":"MAX(0,(V183+W183)-INDEX(CostoParametrico!$E$3:$L$18,MATCH($Y183,CostoParametrico!$D$3:$D$18,0),3)-AC183)*IF(AND($D$20=\"A\",MID(F183,1,1)<>\"A\"),0%,100%)","v":0},{"$f":"INDEX(CostoParametrico!$E$3:$L$18,MATCH($Y183,CostoParametrico!$D$3:$D$18,0),5)","v":400},{"$f":"INDEX(CostoParametrico!$E$3:$L$18,MATCH($Y183,CostoParametrico!$D$3:$D$18,0),6)","v":330},{"$f":"INDEX(CostoParametrico!$E$3:$L$18,MATCH($Y183,CostoParametrico!$D$3:$D$18,0),7)","v":300},{"$f":"INDEX(CostoParametrico!$E$3:$L$18,MATCH($Y183,CostoParametrico!$D$3:$D$18,0),8)","v":300},0,0,0,0,0,0,0,1,0,0,0,0,0,0,0,0,0,0,0,0,0,0,0,0,0,1.1000000000000001]
[1,1,43,1,"N","A - Abitativo",0,0,"Privata",10,"N",0,0,0,0,"N","N","L0",0,0,0,0,0,0,"Abitativa-L0",0,{"$f":"MAX(0,(V184)-INDEX(CostoParametrico!$E$3:$L$18,MATCH($Y184,CostoParametrico!$D$3:$D$18,0),1)-AB184-AC184)*IF(AND($D$20=\"A\",MID($F184,1,1)<>\"A\"),0%,100%)","v":0},{"$f":"MAX(0,(V184)-INDEX(CostoParametrico!$E$3:$L$18,MATCH($Y184,CostoParametrico!$D$3:$D$18,0),2)-AC184)*IF(AND($D$20=\"A\",MID($F184,1,1)<>\"A\"),0%,100%)","v":0},{"$f":"MAX(0,(V184)-INDEX(CostoParametrico!$E$3:$L$18,MATCH($Y184,CostoParametrico!$D$3:$D$18,0),3))*IF(AND($D$20=\"A\",MID($F184,1,1)<>\"A\"),0%,100%)","v":0},0,{"$f":"MAX(0,(V184+W184)-INDEX(CostoParametrico!$E$3:$L$18,MATCH($Y184,CostoParametrico!$D$3:$D$18,0),1)-AA184-AB184-AC184-AF184-AG184)*IF(AND($D$20=\"A\",MID($F184,1,1)<>\"A\"),0%,100%)","v":0},{"$f":"MAX(0,(V184+W184)-INDEX(CostoParametrico!$E$3:$L$18,MATCH($Y184,CostoParametrico!$D$3:$D$18,0),2)-AB184-AC184-AG184)*IF(AND($D$20=\"A\",MID(F184,1,1)<>\"A\"),0%,100%)","v":0},{"$f":"MAX(0,(V184+W184)-INDEX(CostoParametrico!$E$3:$L$18,MATCH($Y184,CostoParametrico!$D$3:$D$18,0),3)-AC184)*IF(AND($D$20=\"A\",MID(F184,1,1)<>\"A\"),0%,100%)","v":0},{"$f":"INDEX(CostoParametrico!$E$3:$L$18,MATCH($Y184,CostoParametrico!$D$3:$D$18,0),5)","v":400},{"$f":"INDEX(CostoParametrico!$E$3:$L$18,MATCH($Y184,CostoParametrico!$D$3:$D$18,0),6)","v":330},{"$f":"INDEX(CostoParametrico!$E$3:$L$18,MATCH($Y184,CostoParametrico!$D$3:$D$18,0),7)","v":300},{"$f":"INDEX(CostoParametrico!$E$3:$L$18,MATCH($Y184,CostoParametrico!$D$3:$D$18,0),8)","v":300},0,0,0,0,0,0,0,1,0,0,0,0,0,0,0,0,0,0,0,0,0,0,0,0,0,1.1000000000000001]
[1,1,44,1,"N","A - Abitativo",0,0,"Privata",10,"N",0,0,0,0,"N","N","L0",0,0,0,0,0,0,"Abitativa-L0",0,{"$f":"MAX(0,(V185)-INDEX(CostoParametrico!$E$3:$L$18,MATCH($Y185,CostoParametrico!$D$3:$D$18,0),1)-AB185-AC185)*IF(AND($D$20=\"A\",MID($F185,1,1)<>\"A\"),0%,100%)","v":0},{"$f":"MAX(0,(V185)-INDEX(CostoParametrico!$E$3:$L$18,MATCH($Y185,CostoParametrico!$D$3:$D$18,0),2)-AC185)*IF(AND($D$20=\"A\",MID($F185,1,1)<>\"A\"),0%,100%)","v":0},{"$f":"MAX(0,(V185)-INDEX(CostoParametrico!$E$3:$L$18,MATCH($Y185,CostoParametrico!$D$3:$D$18,0),3))*IF(AND($D$20=\"A\",MID($F185,1,1)<>\"A\"),0%,100%)","v":0},0,{"$f":"MAX(0,(V185+W185)-INDEX(CostoParametrico!$E$3:$L$18,MATCH($Y185,CostoParametrico!$D$3:$D$18,0),1)-AA185-AB185-AC185-AF185-AG185)*IF(AND($D$20=\"A\",MID($F185,1,1)<>\"A\"),0%,100%)","v":0},{"$f":"MAX(0,(V185+W185)-INDEX(CostoParametrico!$E$3:$L$18,MATCH($Y185,CostoParametrico!$D$3:$D$18,0),2)-AB185-AC185-AG185)*IF(AND($D$20=\"A\",MID(F185,1,1)<>\"A\"),0%,100%)","v":0},{"$f":"MAX(0,(V185+W185)-INDEX(CostoParametrico!$E$3:$L$18,MATCH($Y185,CostoParametrico!$D$3:$D$18,0),3)-AC185)*IF(AND($D$20=\"A\",MID(F185,1,1)<>\"A\"),0%,100%)","v":0},{"$f":"INDEX(CostoParametrico!$E$3:$L$18,MATCH($Y185,CostoParametrico!$D$3:$D$18,0),5)","v":400},{"$f":"INDEX(CostoParametrico!$E$3:$L$18,MATCH($Y185,CostoParametrico!$D$3:$D$18,0),6)","v":330},{"$f":"INDEX(CostoParametrico!$E$3:$L$18,MATCH($Y185,CostoParametrico!$D$3:$D$18,0),7)","v":300},{"$f":"INDEX(CostoParametrico!$E$3:$L$18,MATCH($Y185,CostoParametrico!$D$3:$D$18,0),8)","v":300},0,0,0,0,0,0,0,1,0,0,0,0,0,0,0,0,0,0,0,0,0,0,0,0,0,1.1000000000000001]
[1,1,45,1,"N","A - Abitativo",0,0,"Privata",10,"N",0,0,0,0,"N","N","L0",0,0,0,0,0,0,"Abitativa-L0",0,{"$f":"MAX(0,(V186)-INDEX(CostoParametrico!$E$3:$L$18,MATCH($Y186,CostoParametrico!$D$3:$D$18,0),1)-AB186-AC186)*IF(AND($D$20=\"A\",MID($F186,1,1)<>\"A\"),0%,100%)","v":0},{"$f":"MAX(0,(V186)-INDEX(CostoParametrico!$E$3:$L$18,MATCH($Y186,CostoParametrico!$D$3:$D$18,0),2)-AC186)*IF(AND($D$20=\"A\",MID($F186,1,1)<>\"A\"),0%,100%)","v":0},{"$f":"MAX(0,(V186)-INDEX(CostoParametrico!$E$3:$L$18,MATCH($Y186,CostoParametrico!$D$3:$D$18,0),3))*IF(AND($D$20=\"A\",MID($F186,1,1)<>\"A\"),0%,100%)","v":0},0,{"$f":"MAX(0,(V186+W186)-INDEX(CostoParametrico!$E$3:$L$18,MATCH($Y186,CostoParametrico!$D$3:$D$18,0),1)-AA186-AB186-AC186-AF186-AG186)*IF(AND($D$20=\"A\",MID($F186,1,1)<>\"A\"),0%,100%)","v":0},{"$f":"MAX(0,(V186+W186)-INDEX(CostoParametrico!$E$3:$L$18,MATCH($Y186,CostoParametrico!$D$3:$D$18,0),2)-AB186-AC186-AG186)*IF(AND($D$20=\"A\",MID(F186,1,1)<>\"A\"),0%,100%)","v":0},{"$f":"MAX(0,(V186+W186)-INDEX(CostoParametrico!$E$3:$L$18,MATCH($Y186,CostoParametrico!$D$3:$D$18,0),3)-AC186)*IF(AND($D$20=\"A\",MID(F186,1,1)<>\"A\"),0%,100%)","v":0},{"$f":"INDEX(CostoParametrico!$E$3:$L$18,MATCH($Y186,CostoParametrico!$D$3:$D$18,0),5)","v":400},{"$f":"INDEX(CostoParametrico!$E$3:$L$18,MATCH($Y186,CostoParametrico!$D$3:$D$18,0),6)","v":330},{"$f":"INDEX(CostoParametrico!$E$3:$L$18,MATCH($Y186,CostoParametrico!$D$3:$D$18,0),7)","v":300},{"$f":"INDEX(CostoParametrico!$E$3:$L$18,MATCH($Y186,CostoParametrico!$D$3:$D$18,0),8)","v":300},0,0,0,0,0,0,0,1,0,0,0,0,0,0,0,0,0,0,0,0,0,0,0,0,0,1.1000000000000001]
[1,1,46,1,"N","A - Abitativo",0,0,"Privata",10,"N",0,0,0,0,"N","N","L0",0,0,0,0,0,0,"Abitativa-L0",0,{"$f":"MAX(0,(V187)-INDEX(CostoParametrico!$E$3:$L$18,MATCH($Y187,CostoParametrico!$D$3:$D$18,0),1)-AB187-AC187)*IF(AND($D$20=\"A\",MID($F187,1,1)<>\"A\"),0%,100%)","v":0},{"$f":"MAX(0,(V187)-INDEX(CostoParametrico!$E$3:$L$18,MATCH($Y187,CostoParametrico!$D$3:$D$18,0),2)-AC187)*IF(AND($D$20=\"A\",MID($F187,1,1)<>\"A\"),0%,100%)","v":0},{"$f":"MAX(0,(V187)-INDEX(CostoParametrico!$E$3:$L$18,MATCH($Y187,CostoParametrico!$D$3:$D$18,0),3))*IF(AND($D$20=\"A\",MID($F187,1,1)<>\"A\"),0%,100%)","v":0},0,{"$f":"MAX(0,(V187+W187)-INDEX(CostoParametrico!$E$3:$L$18,MATCH($Y187,CostoParametrico!$D$3:$D$18,0),1)-AA187-AB187-AC187-AF187-AG187)*IF(AND($D$20=\"A\",MID($F187,1,1)<>\"A\"),0%,100%)","v":0},{"$f":"MAX(0,(V187+W187)-INDEX(CostoParametrico!$E$3:$L$18,MATCH($Y187,CostoParametrico!$D$3:$D$18,0),2)-AB187-AC187-AG187)*IF(AND($D$20=\"A\",MID(F187,1,1)<>\"A\"),0%,100%)","v":0},{"$f":"MAX(0,(V187+W187)-INDEX(CostoParametrico!$E$3:$L$18,MATCH($Y187,CostoParametrico!$D$3:$D$18,0),3)-AC187)*IF(AND($D$20=\"A\",MID(F187,1,1)<>\"A\"),0%,100%)","v":0},{"$f":"INDEX(CostoParametrico!$E$3:$L$18,MATCH($Y187,CostoParametrico!$D$3:$D$18,0),5)","v":400},{"$f":"INDEX(CostoParametrico!$E$3:$L$18,MATCH($Y187,CostoParametrico!$D$3:$D$18,0),6)","v":330},{"$f":"INDEX(CostoParametrico!$E$3:$L$18,MATCH($Y187,CostoParametrico!$D$3:$D$18,0),7)","v":300},{"$f":"INDEX(CostoParametrico!$E$3:$L$18,MATCH($Y187,CostoParametrico!$D$3:$D$18,0),8)","v":300},0,0,0,0,0,0,0,1,0,0,0,0,0,0,0,0,0,0,0,0,0,0,0,0,0,1.1000000000000001]
[1,1,47,1,"N","A - Abitativo",0,0,"Privata",10,"N",0,0,0,0,"N","N","L0",0,0,0,0,0,0,"Abitativa-L0",0,{"$f":"MAX(0,(V188)-INDEX(CostoParametrico!$E$3:$L$18,MATCH($Y188,CostoParametrico!$D$3:$D$18,0),1)-AB188-AC188)*IF(AND($D$20=\"A\",MID($F188,1,1)<>\"A\"),0%,100%)","v":0},{"$f":"MAX(0,(V188)-INDEX(CostoParametrico!$E$3:$L$18,MATCH($Y188,CostoParametrico!$D$3:$D$18,0),2)-AC188)*IF(AND($D$20=\"A\",MID($F188,1,1)<>\"A\"),0%,100%)","v":0},{"$f":"MAX(0,(V188)-INDEX(CostoParametrico!$E$3:$L$18,MATCH($Y188,CostoParametrico!$D$3:$D$18,0),3))*IF(AND($D$20=\"A\",MID($F188,1,1)<>\"A\"),0%,100%)","v":0},0,{"$f":"MAX(0,(V188+W188)-INDEX(CostoParametrico!$E$3:$L$18,MATCH($Y188,CostoParametrico!$D$3:$D$18,0),1)-AA188-AB188-AC188-AF188-AG188)*IF(AND($D$20=\"A\",MID($F188,1,1)<>\"A\"),0%,100%)","v":0},{"$f":"MAX(0,(V188+W188)-INDEX(CostoParametrico!$E$3:$L$18,MATCH($Y188,CostoParametrico!$D$3:$D$18,0),2)-AB188-AC188-AG188)*IF(AND($D$20=\"A\",MID(F188,1,1)<>\"A\"),0%,100%)","v":0},{"$f":"MAX(0,(V188+W188)-INDEX(CostoParametrico!$E$3:$L$18,MATCH($Y188,CostoParametrico!$D$3:$D$18,0),3)-AC188)*IF(AND($D$20=\"A\",MID(F188,1,1)<>\"A\"),0%,100%)","v":0},{"$f":"INDEX(CostoParametrico!$E$3:$L$18,MATCH($Y188,CostoParametrico!$D$3:$D$18,0),5)","v":400},{"$f":"INDEX(CostoParametrico!$E$3:$L$18,MATCH($Y188,CostoParametrico!$D$3:$D$18,0),6)","v":330},{"$f":"INDEX(CostoParametrico!$E$3:$L$18,MATCH($Y188,CostoParametrico!$D$3:$D$18,0),7)","v":300},{"$f":"INDEX(CostoParametrico!$E$3:$L$18,MATCH($Y188,CostoParametrico!$D$3:$D$18,0),8)","v":300},0,0,0,0,0,0,0,1,0,0,0,0,0,0,0,0,0,0,0,0,0,0,0,0,0,1.1000000000000001]
[1,1,48,1,"N","A - Abitativo",0,0,"Privata",10,"N",0,0,0,0,"N","N","L0",0,0,0,0,0,0,"Abitativa-L0",0,{"$f":"MAX(0,(V189)-INDEX(CostoParametrico!$E$3:$L$18,MATCH($Y189,CostoParametrico!$D$3:$D$18,0),1)-AB189-AC189)*IF(AND($D$20=\"A\",MID($F189,1,1)<>\"A\"),0%,100%)","v":0},{"$f":"MAX(0,(V189)-INDEX(CostoParametrico!$E$3:$L$18,MATCH($Y189,CostoParametrico!$D$3:$D$18,0),2)-AC189)*IF(AND($D$20=\"A\",MID($F189,1,1)<>\"A\"),0%,100%)","v":0},{"$f":"MAX(0,(V189)-INDEX(CostoParametrico!$E$3:$L$18,MATCH($Y189,CostoParametrico!$D$3:$D$18,0),3))*IF(AND($D$20=\"A\",MID($F189,1,1)<>\"A\"),0%,100%)","v":0},0,{"$f":"MAX(0,(V189+W189)-INDEX(CostoParametrico!$E$3:$L$18,MATCH($Y189,CostoParametrico!$D$3:$D$18,0),1)-AA189-AB189-AC189-AF189-AG189)*IF(AND($D$20=\"A\",MID($F189,1,1)<>\"A\"),0%,100%)","v":0},{"$f":"MAX(0,(V189+W189)-INDEX(CostoParametrico!$E$3:$L$18,MATCH($Y189,CostoParametrico!$D$3:$D$18,0),2)-AB189-AC189-AG189)*IF(AND($D$20=\"A\",MID(F189,1,1)<>\"A\"),0%,100%)","v":0},{"$f":"MAX(0,(V189+W189)-INDEX(CostoParametrico!$E$3:$L$18,MATCH($Y189,CostoParametrico!$D$3:$D$18,0),3)-AC189)*IF(AND($D$20=\"A\",MID(F189,1,1)<>\"A\"),0%,100%)","v":0},{"$f":"INDEX(CostoParametrico!$E$3:$L$18,MATCH($Y189,CostoParametrico!$D$3:$D$18,0),5)","v":400},{"$f":"INDEX(CostoParametrico!$E$3:$L$18,MATCH($Y189,CostoParametrico!$D$3:$D$18,0),6)","v":330},{"$f":"INDEX(CostoParametrico!$E$3:$L$18,MATCH($Y189,CostoParametrico!$D$3:$D$18,0),7)","v":300},{"$f":"INDEX(CostoParametrico!$E$3:$L$18,MATCH($Y189,CostoParametrico!$D$3:$D$18,0),8)","v":300},0,0,0,0,0,0,0,1,0,0,0,0,0,0,0,0,0,0,0,0,0,0,0,0,0,1.1000000000000001]
[1,1,49,1,"N","A - Abitativo",0,0,"Privata",10,"N",0,0,0,0,"N","N","L0",0,0,0,0,0,0,"Abitativa-L0",0,{"$f":"MAX(0,(V190)-INDEX(CostoParametrico!$E$3:$L$18,MATCH($Y190,CostoParametrico!$D$3:$D$18,0),1)-AB190-AC190)*IF(AND($D$20=\"A\",MID($F190,1,1)<>\"A\"),0%,100%)","v":0},{"$f":"MAX(0,(V190)-INDEX(CostoParametrico!$E$3:$L$18,MATCH($Y190,CostoParametrico!$D$3:$D$18,0),2)-AC190)*IF(AND($D$20=\"A\",MID($F190,1,1)<>\"A\"),0%,100%)","v":0},{"$f":"MAX(0,(V190)-INDEX(CostoParametrico!$E$3:$L$18,MATCH($Y190,CostoParametrico!$D$3:$D$18,0),3))*IF(AND($D$20=\"A\",MID($F190,1,1)<>\"A\"),0%,100%)","v":0},0,{"$f":"MAX(0,(V190+W190)-INDEX(CostoParametrico!$E$3:$L$18,MATCH($Y190,CostoParametrico!$D$3:$D$18,0),1)-AA190-AB190-AC190-AF190-AG190)*IF(AND($D$20=\"A\",MID($F190,1,1)<>\"A\"),0%,100%)","v":0},{"$f":"MAX(0,(V190+W190)-INDEX(CostoParametrico!$E$3:$L$18,MATCH($Y190,CostoParametrico!$D$3:$D$18,0),2)-AB190-AC190-AG190)*IF(AND($D$20=\"A\",MID(F190,1,1)<>\"A\"),0%,100%)","v":0},{"$f":"MAX(0,(V190+W190)-INDEX(CostoParametrico!$E$3:$L$18,MATCH($Y190,CostoParametrico!$D$3:$D$18,0),3)-AC190)*IF(AND($D$20=\"A\",MID(F190,1,1)<>\"A\"),0%,100%)","v":0},{"$f":"INDEX(CostoParametrico!$E$3:$L$18,MATCH($Y190,CostoParametrico!$D$3:$D$18,0),5)","v":400},{"$f":"INDEX(CostoParametrico!$E$3:$L$18,MATCH($Y190,CostoParametrico!$D$3:$D$18,0),6)","v":330},{"$f":"INDEX(CostoParametrico!$E$3:$L$18,MATCH($Y190,CostoParametrico!$D$3:$D$18,0),7)","v":300},{"$f":"INDEX(CostoParametrico!$E$3:$L$18,MATCH($Y190,CostoParametrico!$D$3:$D$18,0),8)","v":300},0,0,0,0,0,0,0,1,0,0,0,0,0,0,0,0,0,0,0,0,0,0,0,0,0,1.1000000000000001]
[1,1,50,1,"N","A - Abitativo",0,0,"Privata",10,"N",0,0,0,0,"N","N","L0",0,0,0,0,0,0,"Abitativa-L0",0,{"$f":"MAX(0,(V191)-INDEX(CostoParametrico!$E$3:$L$18,MATCH($Y191,CostoParametrico!$D$3:$D$18,0),1)-AB191-AC191)*IF(AND($D$20=\"A\",MID($F191,1,1)<>\"A\"),0%,100%)","v":0},{"$f":"MAX(0,(V191)-INDEX(CostoParametrico!$E$3:$L$18,MATCH($Y191,CostoParametrico!$D$3:$D$18,0),2)-AC191)*IF(AND($D$20=\"A\",MID($F191,1,1)<>\"A\"),0%,100%)","v":0},{"$f":"MAX(0,(V191)-INDEX(CostoParametrico!$E$3:$L$18,MATCH($Y191,CostoParametrico!$D$3:$D$18,0),3))*IF(AND($D$20=\"A\",MID($F191,1,1)<>\"A\"),0%,100%)","v":0},0,{"$f":"MAX(0,(V191+W191)-INDEX(CostoParametrico!$E$3:$L$18,MATCH($Y191,CostoParametrico!$D$3:$D$18,0),1)-AA191-AB191-AC191-AF191-AG191)*IF(AND($D$20=\"A\",MID($F191,1,1)<>\"A\"),0%,100%)","v":0},{"$f":"MAX(0,(V191+W191)-INDEX(CostoParametrico!$E$3:$L$18,MATCH($Y191,CostoParametrico!$D$3:$D$18,0),2)-AB191-AC191-AG191)*IF(AND($D$20=\"A\",MID(F191,1,1)<>\"A\"),0%,100%)","v":0},{"$f":"MAX(0,(V191+W191)-INDEX(CostoParametrico!$E$3:$L$18,MATCH($Y191,CostoParametrico!$D$3:$D$18,0),3)-AC191)*IF(AND($D$20=\"A\",MID(F191,1,1)<>\"A\"),0%,100%)","v":0},{"$f":"INDEX(CostoParametrico!$E$3:$L$18,MATCH($Y191,CostoParametrico!$D$3:$D$18,0),5)","v":400},{"$f":"INDEX(CostoParametrico!$E$3:$L$18,MATCH($Y191,CostoParametrico!$D$3:$D$18,0),6)","v":330},{"$f":"INDEX(CostoParametrico!$E$3:$L$18,MATCH($Y191,CostoParametrico!$D$3:$D$18,0),7)","v":300},{"$f":"INDEX(CostoParametrico!$E$3:$L$18,MATCH($Y191,CostoParametrico!$D$3:$D$18,0),8)","v":300},0,0,0,0,0,0,0,1,0,0,0,0,0,0,0,0,0,0,0,0,0,0,0,0,0,1.1000000000000001]
[1,1,51,1,"N","A - Abitativo",0,0,"Privata",10,"N",0,0,0,0,"N","N","L0",0,0,0,0,0,0,"Abitativa-L0",0,{"$f":"MAX(0,(V192)-INDEX(CostoParametrico!$E$3:$L$18,MATCH($Y192,CostoParametrico!$D$3:$D$18,0),1)-AB192-AC192)*IF(AND($D$20=\"A\",MID($F192,1,1)<>\"A\"),0%,100%)","v":0},{"$f":"MAX(0,(V192)-INDEX(CostoParametrico!$E$3:$L$18,MATCH($Y192,CostoParametrico!$D$3:$D$18,0),2)-AC192)*IF(AND($D$20=\"A\",MID($F192,1,1)<>\"A\"),0%,100%)","v":0},{"$f":"MAX(0,(V192)-INDEX(CostoParametrico!$E$3:$L$18,MATCH($Y192,CostoParametrico!$D$3:$D$18,0),3))*IF(AND($D$20=\"A\",MID($F192,1,1)<>\"A\"),0%,100%)","v":0},0,{"$f":"MAX(0,(V192+W192)-INDEX(CostoParametrico!$E$3:$L$18,MATCH($Y192,CostoParametrico!$D$3:$D$18,0),1)-AA192-AB192-AC192-AF192-AG192)*IF(AND($D$20=\"A\",MID($F192,1,1)<>\"A\"),0%,100%)","v":0},{"$f":"MAX(0,(V192+W192)-INDEX(CostoParametrico!$E$3:$L$18,MATCH($Y192,CostoParametrico!$D$3:$D$18,0),2)-AB192-AC192-AG192)*IF(AND($D$20=\"A\",MID(F192,1,1)<>\"A\"),0%,100%)","v":0},{"$f":"MAX(0,(V192+W192)-INDEX(CostoParametrico!$E$3:$L$18,MATCH($Y192,CostoParametrico!$D$3:$D$18,0),3)-AC192)*IF(AND($D$20=\"A\",MID(F192,1,1)<>\"A\"),0%,100%)","v":0},{"$f":"INDEX(CostoParametrico!$E$3:$L$18,MATCH($Y192,CostoParametrico!$D$3:$D$18,0),5)","v":400},{"$f":"INDEX(CostoParametrico!$E$3:$L$18,MATCH($Y192,CostoParametrico!$D$3:$D$18,0),6)","v":330},{"$f":"INDEX(CostoParametrico!$E$3:$L$18,MATCH($Y192,CostoParametrico!$D$3:$D$18,0),7)","v":300},{"$f":"INDEX(CostoParametrico!$E$3:$L$18,MATCH($Y192,CostoParametrico!$D$3:$D$18,0),8)","v":300},0,0,0,0,0,0,0,1,0,0,0,0,0,0,0,0,0,0,0,0,0,0,0,0,0,1.1000000000000001]
[1,1,52,1,"N","A - Abitativo",0,0,"Privata",10,"N",0,0,0,0,"N","N","L0",0,0,0,0,0,0,"Abitativa-L0",0,{"$f":"MAX(0,(V193)-INDEX(CostoParametrico!$E$3:$L$18,MATCH($Y193,CostoParametrico!$D$3:$D$18,0),1)-AB193-AC193)*IF(AND($D$20=\"A\",MID($F193,1,1)<>\"A\"),0%,100%)","v":0},{"$f":"MAX(0,(V193)-INDEX(CostoParametrico!$E$3:$L$18,MATCH($Y193,CostoParametrico!$D$3:$D$18,0),2)-AC193)*IF(AND($D$20=\"A\",MID($F193,1,1)<>\"A\"),0%,100%)","v":0},{"$f":"MAX(0,(V193)-INDEX(CostoParametrico!$E$3:$L$18,MATCH($Y193,CostoParametrico!$D$3:$D$18,0),3))*IF(AND($D$20=\"A\",MID($F193,1,1)<>\"A\"),0%,100%)","v":0},0,{"$f":"MAX(0,(V193+W193)-INDEX(CostoParametrico!$E$3:$L$18,MATCH($Y193,CostoParametrico!$D$3:$D$18,0),1)-AA193-AB193-AC193-AF193-AG193)*IF(AND($D$20=\"A\",MID($F193,1,1)<>\"A\"),0%,100%)","v":0},{"$f":"MAX(0,(V193+W193)-INDEX(CostoParametrico!$E$3:$L$18,MATCH($Y193,CostoParametrico!$D$3:$D$18,0),2)-AB193-AC193-AG193)*IF(AND($D$20=\"A\",MID(F193,1,1)<>\"A\"),0%,100%)","v":0},{"$f":"MAX(0,(V193+W193)-INDEX(CostoParametrico!$E$3:$L$18,MATCH($Y193,CostoParametrico!$D$3:$D$18,0),3)-AC193)*IF(AND($D$20=\"A\",MID(F193,1,1)<>\"A\"),0%,100%)","v":0},{"$f":"INDEX(CostoParametrico!$E$3:$L$18,MATCH($Y193,CostoParametrico!$D$3:$D$18,0),5)","v":400},{"$f":"INDEX(CostoParametrico!$E$3:$L$18,MATCH($Y193,CostoParametrico!$D$3:$D$18,0),6)","v":330},{"$f":"INDEX(CostoParametrico!$E$3:$L$18,MATCH($Y193,CostoParametrico!$D$3:$D$18,0),7)","v":300},{"$f":"INDEX(CostoParametrico!$E$3:$L$18,MATCH($Y193,CostoParametrico!$D$3:$D$18,0),8)","v":300},0,0,0,0,0,0,0,1,0,0,0,0,0,0,0,0,0,0,0,0,0,0,0,0,0,1.1000000000000001]
[1,1,53,1,"N","A - Abitativo",0,0,"Privata",10,"N",0,0,0,0,"N","N","L0",0,0,0,0,0,0,"Abitativa-L0",0,{"$f":"MAX(0,(V194)-INDEX(CostoParametrico!$E$3:$L$18,MATCH($Y194,CostoParametrico!$D$3:$D$18,0),1)-AB194-AC194)*IF(AND($D$20=\"A\",MID($F194,1,1)<>\"A\"),0%,100%)","v":0},{"$f":"MAX(0,(V194)-INDEX(CostoParametrico!$E$3:$L$18,MATCH($Y194,CostoParametrico!$D$3:$D$18,0),2)-AC194)*IF(AND($D$20=\"A\",MID($F194,1,1)<>\"A\"),0%,100%)","v":0},{"$f":"MAX(0,(V194)-INDEX(CostoParametrico!$E$3:$L$18,MATCH($Y194,CostoParametrico!$D$3:$D$18,0),3))*IF(AND($D$20=\"A\",MID($F194,1,1)<>\"A\"),0%,100%)","v":0},0,{"$f":"MAX(0,(V194+W194)-INDEX(CostoParametrico!$E$3:$L$18,MATCH($Y194,CostoParametrico!$D$3:$D$18,0),1)-AA194-AB194-AC194-AF194-AG194)*IF(AND($D$20=\"A\",MID($F194,1,1)<>\"A\"),0%,100%)","v":0},{"$f":"MAX(0,(V194+W194)-INDEX(CostoParametrico!$E$3:$L$18,MATCH($Y194,CostoParametrico!$D$3:$D$18,0),2)-AB194-AC194-AG194)*IF(AND($D$20=\"A\",MID(F194,1,1)<>\"A\"),0%,100%)","v":0},{"$f":"MAX(0,(V194+W194)-INDEX(CostoParametrico!$E$3:$L$18,MATCH($Y194,CostoParametrico!$D$3:$D$18,0),3)-AC194)*IF(AND($D$20=\"A\",MID(F194,1,1)<>\"A\"),0%,100%)","v":0},{"$f":"INDEX(CostoParametrico!$E$3:$L$18,MATCH($Y194,CostoParametrico!$D$3:$D$18,0),5)","v":400},{"$f":"INDEX(CostoParametrico!$E$3:$L$18,MATCH($Y194,CostoParametrico!$D$3:$D$18,0),6)","v":330},{"$f":"INDEX(CostoParametrico!$E$3:$L$18,MATCH($Y194,CostoParametrico!$D$3:$D$18,0),7)","v":300},{"$f":"INDEX(CostoParametrico!$E$3:$L$18,MATCH($Y194,CostoParametrico!$D$3:$D$18,0),8)","v":300},0,0,0,0,0,0,0,1,0,0,0,0,0,0,0,0,0,0,0,0,0,0,0,0,0,1.1000000000000001]
[1,1,54,1,"N","A - Abitativo",0,0,"Privata",10,"N",0,0,0,0,"N","N","L0",0,0,0,0,0,0,"Abitativa-L0",0,{"$f":"MAX(0,(V195)-INDEX(CostoParametrico!$E$3:$L$18,MATCH($Y195,CostoParametrico!$D$3:$D$18,0),1)-AB195-AC195)*IF(AND($D$20=\"A\",MID($F195,1,1)<>\"A\"),0%,100%)","v":0},{"$f":"MAX(0,(V195)-INDEX(CostoParametrico!$E$3:$L$18,MATCH($Y195,CostoParametrico!$D$3:$D$18,0),2)-AC195)*IF(AND($D$20=\"A\",MID($F195,1,1)<>\"A\"),0%,100%)","v":0},{"$f":"MAX(0,(V195)-INDEX(CostoParametrico!$E$3:$L$18,MATCH($Y195,CostoParametrico!$D$3:$D$18,0),3))*IF(AND($D$20=\"A\",MID($F195,1,1)<>\"A\"),0%,100%)","v":0},0,{"$f":"MAX(0,(V195+W195)-INDEX(CostoParametrico!$E$3:$L$18,MATCH($Y195,CostoParametrico!$D$3:$D$18,0),1)-AA195-AB195-AC195-AF195-AG195)*IF(AND($D$20=\"A\",MID($F195,1,1)<>\"A\"),0%,100%)","v":0},{"$f":"MAX(0,(V195+W195)-INDEX(CostoParametrico!$E$3:$L$18,MATCH($Y195,CostoParametrico!$D$3:$D$18,0),2)-AB195-AC195-AG195)*IF(AND($D$20=\"A\",MID(F195,1,1)<>\"A\"),0%,100%)","v":0},{"$f":"MAX(0,(V195+W195)-INDEX(CostoParametrico!$E$3:$L$18,MATCH($Y195,CostoParametrico!$D$3:$D$18,0),3)-AC195)*IF(AND($D$20=\"A\",MID(F195,1,1)<>\"A\"),0%,100%)","v":0},{"$f":"INDEX(CostoParametrico!$E$3:$L$18,MATCH($Y195,CostoParametrico!$D$3:$D$18,0),5)","v":400},{"$f":"INDEX(CostoParametrico!$E$3:$L$18,MATCH($Y195,CostoParametrico!$D$3:$D$18,0),6)","v":330},{"$f":"INDEX(CostoParametrico!$E$3:$L$18,MATCH($Y195,CostoParametrico!$D$3:$D$18,0),7)","v":300},{"$f":"INDEX(CostoParametrico!$E$3:$L$18,MATCH($Y195,CostoParametrico!$D$3:$D$18,0),8)","v":300},0,0,0,0,0,0,0,1,0,0,0,0,0,0,0,0,0,0,0,0,0,0,0,0,0,1.1000000000000001]
[1,1,55,1,"N","A - Abitativo",0,0,"Privata",10,"N",0,0,0,0,"N","N","L0",0,0,0,0,0,0,"Abitativa-L0",0,{"$f":"MAX(0,(V196)-INDEX(CostoParametrico!$E$3:$L$18,MATCH($Y196,CostoParametrico!$D$3:$D$18,0),1)-AB196-AC196)*IF(AND($D$20=\"A\",MID($F196,1,1)<>\"A\"),0%,100%)","v":0},{"$f":"MAX(0,(V196)-INDEX(CostoParametrico!$E$3:$L$18,MATCH($Y196,CostoParametrico!$D$3:$D$18,0),2)-AC196)*IF(AND($D$20=\"A\",MID($F196,1,1)<>\"A\"),0%,100%)","v":0},{"$f":"MAX(0,(V196)-INDEX(CostoParametrico!$E$3:$L$18,MATCH($Y196,CostoParametrico!$D$3:$D$18,0),3))*IF(AND($D$20=\"A\",MID($F196,1,1)<>\"A\"),0%,100%)","v":0},0,{"$f":"MAX(0,(V196+W196)-INDEX(CostoParametrico!$E$3:$L$18,MATCH($Y196,CostoParametrico!$D$3:$D$18,0),1)-AA196-AB196-AC196-AF196-AG196)*IF(AND($D$20=\"A\",MID($F196,1,1)<>\"A\"),0%,100%)","v":0},{"$f":"MAX(0,(V196+W196)-INDEX(CostoParametrico!$E$3:$L$18,MATCH($Y196,CostoParametrico!$D$3:$D$18,0),2)-AB196-AC196-AG196)*IF(AND($D$20=\"A\",MID(F196,1,1)<>\"A\"),0%,100%)","v":0},{"$f":"MAX(0,(V196+W196)-INDEX(CostoParametrico!$E$3:$L$18,MATCH($Y196,CostoParametrico!$D$3:$D$18,0),3)-AC196)*IF(AND($D$20=\"A\",MID(F196,1,1)<>\"A\"),0%,100%)","v":0},{"$f":"INDEX(CostoParametrico!$E$3:$L$18,MATCH($Y196,CostoParametrico!$D$3:$D$18,0),5)","v":400},{"$f":"INDEX(CostoParametrico!$E$3:$L$18,MATCH($Y196,CostoParametrico!$D$3:$D$18,0),6)","v":330},{"$f":"INDEX(CostoParametrico!$E$3:$L$18,MATCH($Y196,CostoParametrico!$D$3:$D$18,0),7)","v":300},{"$f":"INDEX(CostoParametrico!$E$3:$L$18,MATCH($Y196,CostoParametrico!$D$3:$D$18,0),8)","v":300},0,0,0,0,0,0,0,1,0,0,0,0,0,0,0,0,0,0,0,0,0,0,0,0,0,1.1000000000000001]
[1,1,56,1,"N","A - Abitativo",0,0,"Privata",10,"N",0,0,0,0,"N","N","L0",0,0,0,0,0,0,"Abitativa-L0",0,{"$f":"MAX(0,(V197)-INDEX(CostoParametrico!$E$3:$L$18,MATCH($Y197,CostoParametrico!$D$3:$D$18,0),1)-AB197-AC197)*IF(AND($D$20=\"A\",MID($F197,1,1)<>\"A\"),0%,100%)","v":0},{"$f":"MAX(0,(V197)-INDEX(CostoParametrico!$E$3:$L$18,MATCH($Y197,CostoParametrico!$D$3:$D$18,0),2)-AC197)*IF(AND($D$20=\"A\",MID($F197,1,1)<>\"A\"),0%,100%)","v":0},{"$f":"MAX(0,(V197)-INDEX(CostoParametrico!$E$3:$L$18,MATCH($Y197,CostoParametrico!$D$3:$D$18,0),3))*IF(AND($D$20=\"A\",MID($F197,1,1)<>\"A\"),0%,100%)","v":0},0,{"$f":"MAX(0,(V197+W197)-INDEX(CostoParametrico!$E$3:$L$18,MATCH($Y197,CostoParametrico!$D$3:$D$18,0),1)-AA197-AB197-AC197-AF197-AG197)*IF(AND($D$20=\"A\",MID($F197,1,1)<>\"A\"),0%,100%)","v":0},{"$f":"MAX(0,(V197+W197)-INDEX(CostoParametrico!$E$3:$L$18,MATCH($Y197,CostoParametrico!$D$3:$D$18,0),2)-AB197-AC197-AG197)*IF(AND($D$20=\"A\",MID(F197,1,1)<>\"A\"),0%,100%)","v":0},{"$f":"MAX(0,(V197+W197)-INDEX(CostoParametrico!$E$3:$L$18,MATCH($Y197,CostoParametrico!$D$3:$D$18,0),3)-AC197)*IF(AND($D$20=\"A\",MID(F197,1,1)<>\"A\"),0%,100%)","v":0},{"$f":"INDEX(CostoParametrico!$E$3:$L$18,MATCH($Y197,CostoParametrico!$D$3:$D$18,0),5)","v":400},{"$f":"INDEX(CostoParametrico!$E$3:$L$18,MATCH($Y197,CostoParametrico!$D$3:$D$18,0),6)","v":330},{"$f":"INDEX(CostoParametrico!$E$3:$L$18,MATCH($Y197,CostoParametrico!$D$3:$D$18,0),7)","v":300},{"$f":"INDEX(CostoParametrico!$E$3:$L$18,MATCH($Y197,CostoParametrico!$D$3:$D$18,0),8)","v":300},0,0,0,0,0,0,0,1,0,0,0,0,0,0,0,0,0,0,0,0,0,0,0,0,0,1.1000000000000001]
[1,1,57,1,"N","A - Abitativo",0,0,"Privata",10,"N",0,0,0,0,"N","N","L0",0,0,0,0,0,0,"Abitativa-L0",0,{"$f":"MAX(0,(V198)-INDEX(CostoParametrico!$E$3:$L$18,MATCH($Y198,CostoParametrico!$D$3:$D$18,0),1)-AB198-AC198)*IF(AND($D$20=\"A\",MID($F198,1,1)<>\"A\"),0%,100%)","v":0},{"$f":"MAX(0,(V198)-INDEX(CostoParametrico!$E$3:$L$18,MATCH($Y198,CostoParametrico!$D$3:$D$18,0),2)-AC198)*IF(AND($D$20=\"A\",MID($F198,1,1)<>\"A\"),0%,100%)","v":0},{"$f":"MAX(0,(V198)-INDEX(CostoParametrico!$E$3:$L$18,MATCH($Y198,CostoParametrico!$D$3:$D$18,0),3))*IF(AND($D$20=\"A\",MID($F198,1,1)<>\"A\"),0%,100%)","v":0},0,{"$f":"MAX(0,(V198+W198)-INDEX(CostoParametrico!$E$3:$L$18,MATCH($Y198,CostoParametrico!$D$3:$D$18,0),1)-AA198-AB198-AC198-AF198-AG198)*IF(AND($D$20=\"A\",MID($F198,1,1)<>\"A\"),0%,100%)","v":0},{"$f":"MAX(0,(V198+W198)-INDEX(CostoParametrico!$E$3:$L$18,MATCH($Y198,CostoParametrico!$D$3:$D$18,0),2)-AB198-AC198-AG198)*IF(AND($D$20=\"A\",MID(F198,1,1)<>\"A\"),0%,100%)","v":0},{"$f":"MAX(0,(V198+W198)-INDEX(CostoParametrico!$E$3:$L$18,MATCH($Y198,CostoParametrico!$D$3:$D$18,0),3)-AC198)*IF(AND($D$20=\"A\",MID(F198,1,1)<>\"A\"),0%,100%)","v":0},{"$f":"INDEX(CostoParametrico!$E$3:$L$18,MATCH($Y198,CostoParametrico!$D$3:$D$18,0),5)","v":400},{"$f":"INDEX(CostoParametrico!$E$3:$L$18,MATCH($Y198,CostoParametrico!$D$3:$D$18,0),6)","v":330},{"$f":"INDEX(CostoParametrico!$E$3:$L$18,MATCH($Y198,CostoParametrico!$D$3:$D$18,0),7)","v":300},{"$f":"INDEX(CostoParametrico!$E$3:$L$18,MATCH($Y198,CostoParametrico!$D$3:$D$18,0),8)","v":300},0,0,0,0,0,0,0,1,0,0,0,0,0,0,0,0,0,0,0,0,0,0,0,0,0,1.1000000000000001]
[1,1,58,1,"N","A - Abitativo",0,0,"Privata",10,"N",0,0,0,0,"N","N","L0",0,0,0,0,0,0,"Abitativa-L0",0,{"$f":"MAX(0,(V199)-INDEX(CostoParametrico!$E$3:$L$18,MATCH($Y199,CostoParametrico!$D$3:$D$18,0),1)-AB199-AC199)*IF(AND($D$20=\"A\",MID($F199,1,1)<>\"A\"),0%,100%)","v":0},{"$f":"MAX(0,(V199)-INDEX(CostoParametrico!$E$3:$L$18,MATCH($Y199,CostoParametrico!$D$3:$D$18,0),2)-AC199)*IF(AND($D$20=\"A\",MID($F199,1,1)<>\"A\"),0%,100%)","v":0},{"$f":"MAX(0,(V199)-INDEX(CostoParametrico!$E$3:$L$18,MATCH($Y199,CostoParametrico!$D$3:$D$18,0),3))*IF(AND($D$20=\"A\",MID($F199,1,1)<>\"A\"),0%,100%)","v":0},0,{"$f":"MAX(0,(V199+W199)-INDEX(CostoParametrico!$E$3:$L$18,MATCH($Y199,CostoParametrico!$D$3:$D$18,0),1)-AA199-AB199-AC199-AF199-AG199)*IF(AND($D$20=\"A\",MID($F199,1,1)<>\"A\"),0%,100%)","v":0},{"$f":"MAX(0,(V199+W199)-INDEX(CostoParametrico!$E$3:$L$18,MATCH($Y199,CostoParametrico!$D$3:$D$18,0),2)-AB199-AC199-AG199)*IF(AND($D$20=\"A\",MID(F199,1,1)<>\"A\"),0%,100%)","v":0},{"$f":"MAX(0,(V199+W199)-INDEX(CostoParametrico!$E$3:$L$18,MATCH($Y199,CostoParametrico!$D$3:$D$18,0),3)-AC199)*IF(AND($D$20=\"A\",MID(F199,1,1)<>\"A\"),0%,100%)","v":0},{"$f":"INDEX(CostoParametrico!$E$3:$L$18,MATCH($Y199,CostoParametrico!$D$3:$D$18,0),5)","v":400},{"$f":"INDEX(CostoParametrico!$E$3:$L$18,MATCH($Y199,CostoParametrico!$D$3:$D$18,0),6)","v":330},{"$f":"INDEX(CostoParametrico!$E$3:$L$18,MATCH($Y199,CostoParametrico!$D$3:$D$18,0),7)","v":300},{"$f":"INDEX(CostoParametrico!$E$3:$L$18,MATCH($Y199,CostoParametrico!$D$3:$D$18,0),8)","v":300},0,0,0,0,0,0,0,1,0,0,0,0,0,0,0,0,0,0,0,0,0,0,0,0,0,1.1000000000000001]
[1,1,59,1,"N","A - Abitativo",0,0,"Privata",10,"N",0,0,0,0,"N","N","L0",0,0,0,0,0,0,"Abitativa-L0",0,{"$f":"MAX(0,(V200)-INDEX(CostoParametrico!$E$3:$L$18,MATCH($Y200,CostoParametrico!$D$3:$D$18,0),1)-AB200-AC200)*IF(AND($D$20=\"A\",MID($F200,1,1)<>\"A\"),0%,100%)","v":0},{"$f":"MAX(0,(V200)-INDEX(CostoParametrico!$E$3:$L$18,MATCH($Y200,CostoParametrico!$D$3:$D$18,0),2)-AC200)*IF(AND($D$20=\"A\",MID($F200,1,1)<>\"A\"),0%,100%)","v":0},{"$f":"MAX(0,(V200)-INDEX(CostoParametrico!$E$3:$L$18,MATCH($Y200,CostoParametrico!$D$3:$D$18,0),3))*IF(AND($D$20=\"A\",MID($F200,1,1)<>\"A\"),0%,100%)","v":0},0,{"$f":"MAX(0,(V200+W200)-INDEX(CostoParametrico!$E$3:$L$18,MATCH($Y200,CostoParametrico!$D$3:$D$18,0),1)-AA200-AB200-AC200-AF200-AG200)*IF(AND($D$20=\"A\",MID($F200,1,1)<>\"A\"),0%,100%)","v":0},{"$f":"MAX(0,(V200+W200)-INDEX(CostoParametrico!$E$3:$L$18,MATCH($Y200,CostoParametrico!$D$3:$D$18,0),2)-AB200-AC200-AG200)*IF(AND($D$20=\"A\",MID(F200,1,1)<>\"A\"),0%,100%)","v":0},{"$f":"MAX(0,(V200+W200)-INDEX(CostoParametrico!$E$3:$L$18,MATCH($Y200,CostoParametrico!$D$3:$D$18,0),3)-AC200)*IF(AND($D$20=\"A\",MID(F200,1,1)<>\"A\"),0%,100%)","v":0},{"$f":"INDEX(CostoParametrico!$E$3:$L$18,MATCH($Y200,CostoParametrico!$D$3:$D$18,0),5)","v":400},{"$f":"INDEX(CostoParametrico!$E$3:$L$18,MATCH($Y200,CostoParametrico!$D$3:$D$18,0),6)","v":330},{"$f":"INDEX(CostoParametrico!$E$3:$L$18,MATCH($Y200,CostoParametrico!$D$3:$D$18,0),7)","v":300},{"$f":"INDEX(CostoParametrico!$E$3:$L$18,MATCH($Y200,CostoParametrico!$D$3:$D$18,0),8)","v":300},0,0,0,0,0,0,0,1,0,0,0,0,0,0,0,0,0,0,0,0,0,0,0,0,0,1.1000000000000001]
[1,1,60,1,"N","A - Abitativo",0,0,"Privata",10,"N",0,0,0,0,"N","N","L0",0,0,0,0,0,0,"Abitativa-L0",0,{"$f":"MAX(0,(V201)-INDEX(CostoParametrico!$E$3:$L$18,MATCH($Y201,CostoParametrico!$D$3:$D$18,0),1)-AB201-AC201)*IF(AND($D$20=\"A\",MID($F201,1,1)<>\"A\"),0%,100%)","v":0},{"$f":"MAX(0,(V201)-INDEX(CostoParametrico!$E$3:$L$18,MATCH($Y201,CostoParametrico!$D$3:$D$18,0),2)-AC201)*IF(AND($D$20=\"A\",MID($F201,1,1)<>\"A\"),0%,100%)","v":0},{"$f":"MAX(0,(V201)-INDEX(CostoParametrico!$E$3:$L$18,MATCH($Y201,CostoParametrico!$D$3:$D$18,0),3))*IF(AND($D$20=\"A\",MID($F201,1,1)<>\"A\"),0%,100%)","v":0},0,{"$f":"MAX(0,(V201+W201)-INDEX(CostoParametrico!$E$3:$L$18,MATCH($Y201,CostoParametrico!$D$3:$D$18,0),1)-AA201-AB201-AC201-AF201-AG201)*IF(AND($D$20=\"A\",MID($F201,1,1)<>\"A\"),0%,100%)","v":0},{"$f":"MAX(0,(V201+W201)-INDEX(CostoParametrico!$E$3:$L$18,MATCH($Y201,CostoParametrico!$D$3:$D$18,0),2)-AB201-AC201-AG201)*IF(AND($D$20=\"A\",MID(F201,1,1)<>\"A\"),0%,100%)","v":0},{"$f":"MAX(0,(V201+W201)-INDEX(CostoParametrico!$E$3:$L$18,MATCH($Y201,CostoParametrico!$D$3:$D$18,0),3)-AC201)*IF(AND($D$20=\"A\",MID(F201,1,1)<>\"A\"),0%,100%)","v":0},{"$f":"INDEX(CostoParametrico!$E$3:$L$18,MATCH($Y201,CostoParametrico!$D$3:$D$18,0),5)","v":400},{"$f":"INDEX(CostoParametrico!$E$3:$L$18,MATCH($Y201,CostoParametrico!$D$3:$D$18,0),6)","v":330},{"$f":"INDEX(CostoParametrico!$E$3:$L$18,MATCH($Y201,CostoParametrico!$D$3:$D$18,0),7)","v":300},{"$f":"INDEX(CostoParametrico!$E$3:$L$18,MATCH($Y201,CostoParametrico!$D$3:$D$18,0),8)","v":300},0,0,0,0,0,0,0,1,0,0,0,0,0,0,0,0,0,0,0,0,0,0,0,0,0,1.1000000000000001]
[1,1,61,1,"N","A - Abitativo",0,0,"Privata",10,"N",0,0,0,0,"N","N","L0",0,0,0,0,0,0,"Abitativa-L0",0,{"$f":"MAX(0,(V202)-INDEX(CostoParametrico!$E$3:$L$18,MATCH($Y202,CostoParametrico!$D$3:$D$18,0),1)-AB202-AC202)*IF(AND($D$20=\"A\",MID($F202,1,1)<>\"A\"),0%,100%)","v":0},{"$f":"MAX(0,(V202)-INDEX(CostoParametrico!$E$3:$L$18,MATCH($Y202,CostoParametrico!$D$3:$D$18,0),2)-AC202)*IF(AND($D$20=\"A\",MID($F202,1,1)<>\"A\"),0%,100%)","v":0},{"$f":"MAX(0,(V202)-INDEX(CostoParametrico!$E$3:$L$18,MATCH($Y202,CostoParametrico!$D$3:$D$18,0),3))*IF(AND($D$20=\"A\",MID($F202,1,1)<>\"A\"),0%,100%)","v":0},0,{"$f":"MAX(0,(V202+W202)-INDEX(CostoParametrico!$E$3:$L$18,MATCH($Y202,CostoParametrico!$D$3:$D$18,0),1)-AA202-AB202-AC202-AF202-AG202)*IF(AND($D$20=\"A\",MID($F202,1,1)<>\"A\"),0%,100%)","v":0},{"$f":"MAX(0,(V202+W202)-INDEX(CostoParametrico!$E$3:$L$18,MATCH($Y202,CostoParametrico!$D$3:$D$18,0),2)-AB202-AC202-AG202)*IF(AND($D$20=\"A\",MID(F202,1,1)<>\"A\"),0%,100%)","v":0},{"$f":"MAX(0,(V202+W202)-INDEX(CostoParametrico!$E$3:$L$18,MATCH($Y202,CostoParametrico!$D$3:$D$18,0),3)-AC202)*IF(AND($D$20=\"A\",MID(F202,1,1)<>\"A\"),0%,100%)","v":0},{"$f":"INDEX(CostoParametrico!$E$3:$L$18,MATCH($Y202,CostoParametrico!$D$3:$D$18,0),5)","v":400},{"$f":"INDEX(CostoParametrico!$E$3:$L$18,MATCH($Y202,CostoParametrico!$D$3:$D$18,0),6)","v":330},{"$f":"INDEX(CostoParametrico!$E$3:$L$18,MATCH($Y202,CostoParametrico!$D$3:$D$18,0),7)","v":300},{"$f":"INDEX(CostoParametrico!$E$3:$L$18,MATCH($Y202,CostoParametrico!$D$3:$D$18,0),8)","v":300},0,0,0,0,0,0,0,1,0,0,0,0,0,0,0,0,0,0,0,0,0,0,0,0,0,1.1000000000000001]
[1,1,62,1,"N","A - Abitativo",0,0,"Privata",10,"N",0,0,0,0,"N","N","L0",0,0,0,0,0,0,"Abitativa-L0",0,{"$f":"MAX(0,(V203)-INDEX(CostoParametrico!$E$3:$L$18,MATCH($Y203,CostoParametrico!$D$3:$D$18,0),1)-AB203-AC203)*IF(AND($D$20=\"A\",MID($F203,1,1)<>\"A\"),0%,100%)","v":0},{"$f":"MAX(0,(V203)-INDEX(CostoParametrico!$E$3:$L$18,MATCH($Y203,CostoParametrico!$D$3:$D$18,0),2)-AC203)*IF(AND($D$20=\"A\",MID($F203,1,1)<>\"A\"),0%,100%)","v":0},{"$f":"MAX(0,(V203)-INDEX(CostoParametrico!$E$3:$L$18,MATCH($Y203,CostoParametrico!$D$3:$D$18,0),3))*IF(AND($D$20=\"A\",MID($F203,1,1)<>\"A\"),0%,100%)","v":0},0,{"$f":"MAX(0,(V203+W203)-INDEX(CostoParametrico!$E$3:$L$18,MATCH($Y203,CostoParametrico!$D$3:$D$18,0),1)-AA203-AB203-AC203-AF203-AG203)*IF(AND($D$20=\"A\",MID($F203,1,1)<>\"A\"),0%,100%)","v":0},{"$f":"MAX(0,(V203+W203)-INDEX(CostoParametrico!$E$3:$L$18,MATCH($Y203,CostoParametrico!$D$3:$D$18,0),2)-AB203-AC203-AG203)*IF(AND($D$20=\"A\",MID(F203,1,1)<>\"A\"),0%,100%)","v":0},{"$f":"MAX(0,(V203+W203)-INDEX(CostoParametrico!$E$3:$L$18,MATCH($Y203,CostoParametrico!$D$3:$D$18,0),3)-AC203)*IF(AND($D$20=\"A\",MID(F203,1,1)<>\"A\"),0%,100%)","v":0},{"$f":"INDEX(CostoParametrico!$E$3:$L$18,MATCH($Y203,CostoParametrico!$D$3:$D$18,0),5)","v":400},{"$f":"INDEX(CostoParametrico!$E$3:$L$18,MATCH($Y203,CostoParametrico!$D$3:$D$18,0),6)","v":330},{"$f":"INDEX(CostoParametrico!$E$3:$L$18,MATCH($Y203,CostoParametrico!$D$3:$D$18,0),7)","v":300},{"$f":"INDEX(CostoParametrico!$E$3:$L$18,MATCH($Y203,CostoParametrico!$D$3:$D$18,0),8)","v":300},0,0,0,0,0,0,0,1,0,0,0,0,0,0,0,0,0,0,0,0,0,0,0,0,0,1.1000000000000001]
[1,1,63,1,"N","A - Abitativo",0,0,"Privata",10,"N",0,0,0,0,"N","N","L0",0,0,0,0,0,0,"Abitativa-L0",0,{"$f":"MAX(0,(V204)-INDEX(CostoParametrico!$E$3:$L$18,MATCH($Y204,CostoParametrico!$D$3:$D$18,0),1)-AB204-AC204)*IF(AND($D$20=\"A\",MID($F204,1,1)<>\"A\"),0%,100%)","v":0},{"$f":"MAX(0,(V204)-INDEX(CostoParametrico!$E$3:$L$18,MATCH($Y204,CostoParametrico!$D$3:$D$18,0),2)-AC204)*IF(AND($D$20=\"A\",MID($F204,1,1)<>\"A\"),0%,100%)","v":0},{"$f":"MAX(0,(V204)-INDEX(CostoParametrico!$E$3:$L$18,MATCH($Y204,CostoParametrico!$D$3:$D$18,0),3))*IF(AND($D$20=\"A\",MID($F204,1,1)<>\"A\"),0%,100%)","v":0},0,{"$f":"MAX(0,(V204+W204)-INDEX(CostoParametrico!$E$3:$L$18,MATCH($Y204,CostoParametrico!$D$3:$D$18,0),1)-AA204-AB204-AC204-AF204-AG204)*IF(AND($D$20=\"A\",MID($F204,1,1)<>\"A\"),0%,100%)","v":0},{"$f":"MAX(0,(V204+W204)-INDEX(CostoParametrico!$E$3:$L$18,MATCH($Y204,CostoParametrico!$D$3:$D$18,0),2)-AB204-AC204-AG204)*IF(AND($D$20=\"A\",MID(F204,1,1)<>\"A\"),0%,100%)","v":0},{"$f":"MAX(0,(V204+W204)-INDEX(CostoParametrico!$E$3:$L$18,MATCH($Y204,CostoParametrico!$D$3:$D$18,0),3)-AC204)*IF(AND($D$20=\"A\",MID(F204,1,1)<>\"A\"),0%,100%)","v":0},{"$f":"INDEX(CostoParametrico!$E$3:$L$18,MATCH($Y204,CostoParametrico!$D$3:$D$18,0),5)","v":400},{"$f":"INDEX(CostoParametrico!$E$3:$L$18,MATCH($Y204,CostoParametrico!$D$3:$D$18,0),6)","v":330},{"$f":"INDEX(CostoParametrico!$E$3:$L$18,MATCH($Y204,CostoParametrico!$D$3:$D$18,0),7)","v":300},{"$f":"INDEX(CostoParametrico!$E$3:$L$18,MATCH($Y204,CostoParametrico!$D$3:$D$18,0),8)","v":300},0,0,0,0,0,0,0,1,0,0,0,0,0,0,0,0,0,0,0,0,0,0,0,0,0,1.1000000000000001]
[1,1,64,1,"N","A - Abitativo",0,0,"Privata",10,"N",0,0,0,0,"N","N","L0",0,0,0,0,0,0,"Abitativa-L0",0,{"$f":"MAX(0,(V205)-INDEX(CostoParametrico!$E$3:$L$18,MATCH($Y205,CostoParametrico!$D$3:$D$18,0),1)-AB205-AC205)*IF(AND($D$20=\"A\",MID($F205,1,1)<>\"A\"),0%,100%)","v":0},{"$f":"MAX(0,(V205)-INDEX(CostoParametrico!$E$3:$L$18,MATCH($Y205,CostoParametrico!$D$3:$D$18,0),2)-AC205)*IF(AND($D$20=\"A\",MID($F205,1,1)<>\"A\"),0%,100%)","v":0},{"$f":"MAX(0,(V205)-INDEX(CostoParametrico!$E$3:$L$18,MATCH($Y205,CostoParametrico!$D$3:$D$18,0),3))*IF(AND($D$20=\"A\",MID($F205,1,1)<>\"A\"),0%,100%)","v":0},0,{"$f":"MAX(0,(V205+W205)-INDEX(CostoParametrico!$E$3:$L$18,MATCH($Y205,CostoParametrico!$D$3:$D$18,0),1)-AA205-AB205-AC205-AF205-AG205)*IF(AND($D$20=\"A\",MID($F205,1,1)<>\"A\"),0%,100%)","v":0},{"$f":"MAX(0,(V205+W205)-INDEX(CostoParametrico!$E$3:$L$18,MATCH($Y205,CostoParametrico!$D$3:$D$18,0),2)-AB205-AC205-AG205)*IF(AND($D$20=\"A\",MID(F205,1,1)<>\"A\"),0%,100%)","v":0},{"$f":"MAX(0,(V205+W205)-INDEX(CostoParametrico!$E$3:$L$18,MATCH($Y205,CostoParametrico!$D$3:$D$18,0),3)-AC205)*IF(AND($D$20=\"A\",MID(F205,1,1)<>\"A\"),0%,100%)","v":0},{"$f":"INDEX(CostoParametrico!$E$3:$L$18,MATCH($Y205,CostoParametrico!$D$3:$D$18,0),5)","v":400},{"$f":"INDEX(CostoParametrico!$E$3:$L$18,MATCH($Y205,CostoParametrico!$D$3:$D$18,0),6)","v":330},{"$f":"INDEX(CostoParametrico!$E$3:$L$18,MATCH($Y205,CostoParametrico!$D$3:$D$18,0),7)","v":300},{"$f":"INDEX(CostoParametrico!$E$3:$L$18,MATCH($Y205,CostoParametrico!$D$3:$D$18,0),8)","v":300},0,0,0,0,0,0,0,1,0,0,0,0,0,0,0,0,0,0,0,0,0,0,0,0,0,1.1000000000000001]
[{"$f":"IF($E206=\"S\",I$9,I$10)","v":1},{"$f":"IF($E206=\"S\",J$9,J$10)","v":1},65,1,"N","A - Abitativo",0,0,"Privata",10,"N",0,0,0,0,"N","N","L0",{"$f":"$F$50","v":0},0,{"$f":"$G$60","v":0},{"$f":"SUM(L206:M206,O206)","v":0},{"$f":"MIN(70%*L206,N206)","v":0},0,{"$f":"IF($D$22=\"DC\",$F$22,$E$20&\"-\"&R206)","v":"Abitativa-L0"},0,{"$f":"MAX(0,(V206)-INDEX(CostoParametrico!$E$3:$L$18,MATCH($Y206,CostoParametrico!$D$3:$D$18,0),1)-AB206-AC206)*IF(AND($D$20=\"A\",MID($F206,1,1)<>\"A\"),0%,100%)","v":0},{"$f":"MAX(0,(V206)-INDEX(CostoParametrico!$E$3:$L$18,MATCH($Y206,CostoParametrico!$D$3:$D$18,0),2)-AC206)*IF(AND($D$20=\"A\",MID($F206,1,1)<>\"A\"),0%,100%)","v":0},{"$f":"MAX(0,(V206)-INDEX(CostoParametrico!$E$3:$L$18,MATCH($Y206,CostoParametrico!$D$3:$D$18,0),3))*IF(AND($D$20=\"A\",MID($F206,1,1)<>\"A\"),0%,100%)","v":0},0,{"$f":"MAX(0,(V206+W206)-INDEX(CostoParametrico!$E$3:$L$18,MATCH($Y206,CostoParametrico!$D$3:$D$18,0),1)-AA206-AB206-AC206-AF206-AG206)*IF(AND($D$20=\"A\",MID($F206,1,1)<>\"A\"),0%,100%)","v":0},{"$f":"MAX(0,(V206+W206)-INDEX(CostoParametrico!$E$3:$L$18,MATCH($Y206,CostoParametrico!$D$3:$D$18,0),2)-AB206-AC206-AG206)*IF(AND($D$20=\"A\",MID(F206,1,1)<>\"A\"),0%,100%)","v":0},{"$f":"MAX(0,(V206+W206)-INDEX(CostoParametrico!$E$3:$L$18,MATCH($Y206,CostoParametrico!$D$3:$D$18,0),3)-AC206)*IF(AND($D$20=\"A\",MID(F206,1,1)<>\"A\"),0%,100%)","v":0},{"$f":"INDEX(CostoParametrico!$E$3:$L$18,MATCH($Y206,CostoParametrico!$D$3:$D$18,0),5)","v":400},{"$f":"INDEX(CostoParametrico!$E$3:$L$18,MATCH($Y206,CostoParametrico!$D$3:$D$18,0),6)","v":330},{"$f":"INDEX(CostoParametrico!$E$3:$L$18,MATCH($Y206,CostoParametrico!$D$3:$D$18,0),7)","v":300},{"$f":"INDEX(CostoParametrico!$E$3:$L$18,MATCH($Y206,CostoParametrico!$D$3:$D$18,0),8)","v":300},0,{"$f":"($M$128-$M$109)*X206","v":0},0,{"$f":"AM206+AN206","v":0},{"$f":"$X206*($X$128-$X$109)","v":0},0,{"$f":"AP206+AQ206","v":0},{"$f":"MIN(1,MAX(AL206,1)/MAX(AR206,1))","v":1},0,0,{"$f":"BA206/BK206","v":0},0,0,0,0,0,0,0,0,0,0,{"$f":"AN206*(1+J206/100)","v":0},0,0,0,{"$f":"(1+J206/100*(1-IF(K206=\"N\",0,IF($F$19=0,1,$F$19))))","v":1.1000000000000001}]
[1,1,66,1,"N","A - Abitativo",0,0,"Privata",10,"N",0,0,0,0,"N","N",{"$f":"E$23","v":"L0"},0,{"$f":"$H$60+IF(AND($D$20=\"P\",OR(MID(F207,1,1)=\"A\",MID(F207,1,1)=\"D\")),80%,0)","v":0},0,0,0,{"$f":"(V207+W207)/MAX(1,(V$140+W$140))","v":0},"Abitativa-L0",{"$f":"MAX(0,(V207)-AA207-AB207-AC207)","v":0},{"$f":"MAX(0,(V207)-INDEX(CostoParametrico!$E$3:$L$18,MATCH($Y207,CostoParametrico!$D$3:$D$18,0),1)-AB207-AC207)*IF(AND($D$20=\"A\",MID($F207,1,1)<>\"A\"),0%,100%)","v":0},{"$f":"MAX(0,(V207)-INDEX(CostoParametrico!$E$3:$L$18,MATCH($Y207,CostoParametrico!$D$3:$D$18,0),2)-AC207)*IF(AND($D$20=\"A\",MID($F207,1,1)<>\"A\"),0%,100%)","v":0},{"$f":"MAX(0,(V207)-INDEX(CostoParametrico!$E$3:$L$18,MATCH($Y207,CostoParametrico!$D$3:$D$18,0),3))*IF(AND($D$20=\"A\",MID($F207,1,1)<>\"A\"),0%,100%)","v":0},{"$f":"MAX(0,(W207)-AC207-AE207-AF207-AG207)","v":0},{"$f":"MAX(0,(V207+W207)-INDEX(CostoParametrico!$E$3:$L$18,MATCH($Y207,CostoParametrico!$D$3:$D$18,0),1)-AA207-AB207-AC207-AF207-AG207)*IF(AND($D$20=\"A\",MID($F207,1,1)<>\"A\"),0%,100%)","v":0},{"$f":"MAX(0,(V207+W207)-INDEX(CostoParametrico!$E$3:$L$18,MATCH($Y207,CostoParametrico!$D$3:$D$18,0),2)-AB207-AC207-AG207)*IF(AND($D$20=\"A\",MID(F207,1,1)<>\"A\"),0%,100%)","v":0},{"$f":"MAX(0,(V207+W207)-INDEX(CostoParametrico!$E$3:$L$18,MATCH($Y207,CostoParametrico!$D$3:$D$18,0),3)-AC207)*IF(AND($D$20=\"A\",MID(F207,1,1)<>\"A\"),0%,100%)","v":0},{"$f":"INDEX(CostoParametrico!$E$3:$L$18,MATCH($Y207,CostoParametrico!$D$3:$D$18,0),5)","v":400},{"$f":"INDEX(CostoParametrico!$E$3:$L$18,MATCH($Y207,CostoParametrico!$D$3:$D$18,0),6)","v":330},{"$f":"INDEX(CostoParametrico!$E$3:$L$18,MATCH($Y207,CostoParametrico!$D$3:$D$18,0),7)","v":300},{"$f":"INDEX(CostoParametrico!$E$3:$L$18,MATCH($Y207,CostoParametrico!$D$3:$D$18,0),8)","v":300},{"$f":"((1+S207+T207)*(Z207*AH$140+AA207*AI$140+AB207*AJ$140+AC207*AK$140)\n+(1+S207+U207)*(AD207*AH$140+AE207*AI$140+AF207*AJ$140+AG207*AK$140))\n*(1+IF(P207=\"N\",0,$G$48))\n*(1+IF(AND(BM207=\"L4\",$D$23=\"DR\",$E$25=\"S\",$E$70=\"S\"),30%,0))\n*IF(AND($D$20=\"P\",MID(F207,1,1)=\"A\"),180%,100%)","v":0},0,{"$f":"H207*(1-M$102)","v":0},0,0,{"$f":"IF($H$140>0,V$109,0)*AN207","v":0},0,1,{"$f":"(AP207*A207+AQ207*B207)*AS207","v":0},{"$f":"AZ207*(Z$128-Z$109)/MAX(10^-12,AC$128-AC$109)","v":0},0,{"$f":"MAX(0,MIN(AP207,AT207)-AU207)","v":0},{"$f":"MAX(0,MIN(AQ207,AT207-AW207)-AV207)","v":0},{"$f":"MAX(0,AT207-AU207-AV207)","v":0},{"$f":"MAX(0,MIN(A207*AP207*AS207*($Y$128-$Y$109)/($X$128-$X$109),G207-BA207))","v":0},{"$f":"MAX(0,MIN(B207*AQ207*BK207,G207))","v":0},{"$f":"MAX(0,MIN(AP207,AT207)*($Y$128-$Y$109)/($X$128-$X$109)-AZ207)","v":0},{"$f":"MAX(0,AX207*BK207-BA207)","v":0},{"$f":"AN207*(1+J207/100)-BC207-BA207","v":0},{"$f":"AM207*($O$128-$O$109)/($M$128-$M$109)-(BB207+AZ207)","v":0},{"$f":"AM207*($O$128-$O$109)/($M$128-$M$109)","v":0},0,{"$f":"$X207*($Y$128-$Y$109)","v":0},{"$f":"AQ207*(1+J207/100)","v":0},{"$f":"((1+S207+T207)*(Z207*AH207+AA207*AI207+AB207*AJ207+AC207*AK207)\n+(1+S207+U207)*(AD207*AH207+AE207*AI207+AF207*AJ207+AG207*AK207))\n*(1+IF(P207=\"N\",0,$G$48))\n*(1+IF(AND(R207=\"L4\",$D$23=\"DR\",$E$25=\"S\",$E$70=\"S\"),30%,0))","v":0},1.1000000000000001]
[1,1,67,1,"N","A - Abitativo",0,0,"Privata",10,"N",0,0,0,0,"N","N","L0",0,0,0,0,0,0,"Abitativa-L0",0,{"$f":"MAX(0,(V208)-INDEX(CostoParametrico!$E$3:$L$18,MATCH($Y208,CostoParametrico!$D$3:$D$18,0),1)-AB208-AC208)*IF(AND($D$20=\"A\",MID($F208,1,1)<>\"A\"),0%,100%)","v":0},{"$f":"MAX(0,(V208)-INDEX(CostoParametrico!$E$3:$L$18,MATCH($Y208,CostoParametrico!$D$3:$D$18,0),2)-AC208)*IF(AND($D$20=\"A\",MID($F208,1,1)<>\"A\"),0%,100%)","v":0},{"$f":"MAX(0,(V208)-INDEX(CostoParametrico!$E$3:$L$18,MATCH($Y208,CostoParametrico!$D$3:$D$18,0),3))*IF(AND($D$20=\"A\",MID($F208,1,1)<>\"A\"),0%,100%)","v":0},0,{"$f":"MAX(0,(V208+W208)-INDEX(CostoParametrico!$E$3:$L$18,MATCH($Y208,CostoParametrico!$D$3:$D$18,0),1)-AA208-AB208-AC208-AF208-AG208)*IF(AND($D$20=\"A\",MID($F208,1,1)<>\"A\"),0%,100%)","v":0},{"$f":"MAX(0,(V208+W208)-INDEX(CostoParametrico!$E$3:$L$18,MATCH($Y208,CostoParametrico!$D$3:$D$18,0),2)-AB208-AC208-AG208)*IF(AND($D$20=\"A\",MID(F208,1,1)<>\"A\"),0%,100%)","v":0},{"$f":"MAX(0,(V208+W208)-INDEX(CostoParametrico!$E$3:$L$18,MATCH($Y208,CostoParametrico!$D$3:$D$18,0),3)-AC208)*IF(AND($D$20=\"A\",MID(F208,1,1)<>\"A\"),0%,100%)","v":0},{"$f":"INDEX(CostoParametrico!$E$3:$L$18,MATCH($Y208,CostoParametrico!$D$3:$D$18,0),5)","v":400},{"$f":"INDEX(CostoParametrico!$E$3:$L$18,MATCH($Y208,CostoParametrico!$D$3:$D$18,0),6)","v":330},{"$f":"INDEX(CostoParametrico!$E$3:$L$18,MATCH($Y208,CostoParametrico!$D$3:$D$18,0),7)","v":300},{"$f":"INDEX(CostoParametrico!$E$3:$L$18,MATCH($Y208,CostoParametrico!$D$3:$D$18,0),8)","v":300},0,0,0,0,0,0,0,1,0,0,0,0,0,0,0,0,0,0,0,0,0,0,0,0,0,1.1000000000000001]
[1,1,68,1,"N","A - Abitativo",0,0,"Privata",10,"N",0,0,0,0,"N","N","L0",0,0,0,0,0,0,"Abitativa-L0",0,{"$f":"MAX(0,(V209)-INDEX(CostoParametrico!$E$3:$L$18,MATCH($Y209,CostoParametrico!$D$3:$D$18,0),1)-AB209-AC209)*IF(AND($D$20=\"A\",MID($F209,1,1)<>\"A\"),0%,100%)","v":0},{"$f":"MAX(0,(V209)-INDEX(CostoParametrico!$E$3:$L$18,MATCH($Y209,CostoParametrico!$D$3:$D$18,0),2)-AC209)*IF(AND($D$20=\"A\",MID($F209,1,1)<>\"A\"),0%,100%)","v":0},{"$f":"MAX(0,(V209)-INDEX(CostoParametrico!$E$3:$L$18,MATCH($Y209,CostoParametrico!$D$3:$D$18,0),3))*IF(AND($D$20=\"A\",MID($F209,1,1)<>\"A\"),0%,100%)","v":0},0,{"$f":"MAX(0,(V209+W209)-INDEX(CostoParametrico!$E$3:$L$18,MATCH($Y209,CostoParametrico!$D$3:$D$18,0),1)-AA209-AB209-AC209-AF209-AG209)*IF(AND($D$20=\"A\",MID($F209,1,1)<>\"A\"),0%,100%)","v":0},{"$f":"MAX(0,(V209+W209)-INDEX(CostoParametrico!$E$3:$L$18,MATCH($Y209,CostoParametrico!$D$3:$D$18,0),2)-AB209-AC209-AG209)*IF(AND($D$20=\"A\",MID(F209,1,1)<>\"A\"),0%,100%)","v":0},{"$f":"MAX(0,(V209+W209)-INDEX(CostoParametrico!$E$3:$L$18,MATCH($Y209,CostoParametrico!$D$3:$D$18,0),3)-AC209)*IF(AND($D$20=\"A\",MID(F209,1,1)<>\"A\"),0%,100%)","v":0},{"$f":"INDEX(CostoParametrico!$E$3:$L$18,MATCH($Y209,CostoParametrico!$D$3:$D$18,0),5)","v":400},{"$f":"INDEX(CostoParametrico!$E$3:$L$18,MATCH($Y209,CostoParametrico!$D$3:$D$18,0),6)","v":330},{"$f":"INDEX(CostoParametrico!$E$3:$L$18,MATCH($Y209,CostoParametrico!$D$3:$D$18,0),7)","v":300},{"$f":"INDEX(CostoParametrico!$E$3:$L$18,MATCH($Y209,CostoParametrico!$D$3:$D$18,0),8)","v":300},0,0,0,0,0,0,0,1,0,0,0,0,0,0,0,0,0,0,0,0,0,0,0,0,0,1.1000000000000001]
[1,1,69,1,"N","A - Abitativo",0,0,"Privata",10,"N",0,0,0,0,"N","N","L0",0,0,0,0,0,0,"Abitativa-L0",0,{"$f":"MAX(0,(V210)-INDEX(CostoParametrico!$E$3:$L$18,MATCH($Y210,CostoParametrico!$D$3:$D$18,0),1)-AB210-AC210)*IF(AND($D$20=\"A\",MID($F210,1,1)<>\"A\"),0%,100%)","v":0},{"$f":"MAX(0,(V210)-INDEX(CostoParametrico!$E$3:$L$18,MATCH($Y210,CostoParametrico!$D$3:$D$18,0),2)-AC210)*IF(AND($D$20=\"A\",MID($F210,1,1)<>\"A\"),0%,100%)","v":0},{"$f":"MAX(0,(V210)-INDEX(CostoParametrico!$E$3:$L$18,MATCH($Y210,CostoParametrico!$D$3:$D$18,0),3))*IF(AND($D$20=\"A\",MID($F210,1,1)<>\"A\"),0%,100%)","v":0},0,{"$f":"MAX(0,(V210+W210)-INDEX(CostoParametrico!$E$3:$L$18,MATCH($Y210,CostoParametrico!$D$3:$D$18,0),1)-AA210-AB210-AC210-AF210-AG210)*IF(AND($D$20=\"A\",MID($F210,1,1)<>\"A\"),0%,100%)","v":0},{"$f":"MAX(0,(V210+W210)-INDEX(CostoParametrico!$E$3:$L$18,MATCH($Y210,CostoParametrico!$D$3:$D$18,0),2)-AB210-AC210-AG210)*IF(AND($D$20=\"A\",MID(F210,1,1)<>\"A\"),0%,100%)","v":0},{"$f":"MAX(0,(V210+W210)-INDEX(CostoParametrico!$E$3:$L$18,MATCH($Y210,CostoParametrico!$D$3:$D$18,0),3)-AC210)*IF(AND($D$20=\"A\",MID(F210,1,1)<>\"A\"),0%,100%)","v":0},{"$f":"INDEX(CostoParametrico!$E$3:$L$18,MATCH($Y210,CostoParametrico!$D$3:$D$18,0),5)","v":400},{"$f":"INDEX(CostoParametrico!$E$3:$L$18,MATCH($Y210,CostoParametrico!$D$3:$D$18,0),6)","v":330},{"$f":"INDEX(CostoParametrico!$E$3:$L$18,MATCH($Y210,CostoParametrico!$D$3:$D$18,0),7)","v":300},{"$f":"INDEX(CostoParametrico!$E$3:$L$18,MATCH($Y210,CostoParametrico!$D$3:$D$18,0),8)","v":300},0,0,0,0,0,0,0,1,0,0,0,0,0,0,0,0,0,0,0,0,0,0,0,0,0,1.1000000000000001]
[1,1,70,1,"N","A - Abitativo",0,0,"Privata",10,"N",0,0,0,0,"N","N","L0",0,0,0,0,0,0,"Abitativa-L0",0,{"$f":"MAX(0,(V211)-INDEX(CostoParametrico!$E$3:$L$18,MATCH($Y211,CostoParametrico!$D$3:$D$18,0),1)-AB211-AC211)*IF(AND($D$20=\"A\",MID($F211,1,1)<>\"A\"),0%,100%)","v":0},{"$f":"MAX(0,(V211)-INDEX(CostoParametrico!$E$3:$L$18,MATCH($Y211,CostoParametrico!$D$3:$D$18,0),2)-AC211)*IF(AND($D$20=\"A\",MID($F211,1,1)<>\"A\"),0%,100%)","v":0},{"$f":"MAX(0,(V211)-INDEX(CostoParametrico!$E$3:$L$18,MATCH($Y211,CostoParametrico!$D$3:$D$18,0),3))*IF(AND($D$20=\"A\",MID($F211,1,1)<>\"A\"),0%,100%)","v":0},0,{"$f":"MAX(0,(V211+W211)-INDEX(CostoParametrico!$E$3:$L$18,MATCH($Y211,CostoParametrico!$D$3:$D$18,0),1)-AA211-AB211-AC211-AF211-AG211)*IF(AND($D$20=\"A\",MID($F211,1,1)<>\"A\"),0%,100%)","v":0},{"$f":"MAX(0,(V211+W211)-INDEX(CostoParametrico!$E$3:$L$18,MATCH($Y211,CostoParametrico!$D$3:$D$18,0),2)-AB211-AC211-AG211)*IF(AND($D$20=\"A\",MID(F211,1,1)<>\"A\"),0%,100%)","v":0},{"$f":"MAX(0,(V211+W211)-INDEX(CostoParametrico!$E$3:$L$18,MATCH($Y211,CostoParametrico!$D$3:$D$18,0),3)-AC211)*IF(AND($D$20=\"A\",MID(F211,1,1)<>\"A\"),0%,100%)","v":0},{"$f":"INDEX(CostoParametrico!$E$3:$L$18,MATCH($Y211,CostoParametrico!$D$3:$D$18,0),5)","v":400},{"$f":"INDEX(CostoParametrico!$E$3:$L$18,MATCH($Y211,CostoParametrico!$D$3:$D$18,0),6)","v":330},{"$f":"INDEX(CostoParametrico!$E$3:$L$18,MATCH($Y211,CostoParametrico!$D$3:$D$18,0),7)","v":300},{"$f":"INDEX(CostoParametrico!$E$3:$L$18,MATCH($Y211,CostoParametrico!$D$3:$D$18,0),8)","v":300},0,0,0,0,0,0,0,1,0,0,0,0,0,0,0,0,0,0,0,0,0,0,0,0,0,1.1000000000000001]
[1,1,71,1,"N","A - Abitativo",0,0,"Privata",10,"N",0,0,0,0,"N","N","L0",0,0,0,0,0,0,"Abitativa-L0",0,{"$f":"MAX(0,(V212)-INDEX(CostoParametrico!$E$3:$L$18,MATCH($Y212,CostoParametrico!$D$3:$D$18,0),1)-AB212-AC212)*IF(AND($D$20=\"A\",MID($F212,1,1)<>\"A\"),0%,100%)","v":0},{"$f":"MAX(0,(V212)-INDEX(CostoParametrico!$E$3:$L$18,MATCH($Y212,CostoParametrico!$D$3:$D$18,0),2)-AC212)*IF(AND($D$20=\"A\",MID($F212,1,1)<>\"A\"),0%,100%)","v":0},{"$f":"MAX(0,(V212)-INDEX(CostoParametrico!$E$3:$L$18,MATCH($Y212,CostoParametrico!$D$3:$D$18,0),3))*IF(AND($D$20=\"A\",MID($F212,1,1)<>\"A\"),0%,100%)","v":0},0,{"$f":"MAX(0,(V212+W212)-INDEX(CostoParametrico!$E$3:$L$18,MATCH($Y212,CostoParametrico!$D$3:$D$18,0),1)-AA212-AB212-AC212-AF212-AG212)*IF(AND($D$20=\"A\",MID($F212,1,1)<>\"A\"),0%,100%)","v":0},{"$f":"MAX(0,(V212+W212)-INDEX(CostoParametrico!$E$3:$L$18,MATCH($Y212,CostoParametrico!$D$3:$D$18,0),2)-AB212-AC212-AG212)*IF(AND($D$20=\"A\",MID(F212,1,1)<>\"A\"),0%,100%)","v":0},{"$f":"MAX(0,(V212+W212)-INDEX(CostoParametrico!$E$3:$L$18,MATCH($Y212,CostoParametrico!$D$3:$D$18,0),3)-AC212)*IF(AND($D$20=\"A\",MID(F212,1,1)<>\"A\"),0%,100%)","v":0},{"$f":"INDEX(CostoParametrico!$E$3:$L$18,MATCH($Y212,CostoParametrico!$D$3:$D$18,0),5)","v":400},{"$f":"INDEX(CostoParametrico!$E$3:$L$18,MATCH($Y212,CostoParametrico!$D$3:$D$18,0),6)","v":330},{"$f":"INDEX(CostoParametrico!$E$3:$L$18,MATCH($Y212,CostoParametrico!$D$3:$D$18,0),7)","v":300},{"$f":"INDEX(CostoParametrico!$E$3:$L$18,MATCH($Y212,CostoParametrico!$D$3:$D$18,0),8)","v":300},0,0,0,0,0,0,0,1,0,0,0,0,0,0,0,0,0,0,0,0,0,0,0,0,0,1.1000000000000001]
[1,1,72,1,"N","A - Abitativo",0,0,"Privata",10,"N",0,0,0,0,"N","N","L0",0,0,0,0,0,0,"Abitativa-L0",0,{"$f":"MAX(0,(V213)-INDEX(CostoParametrico!$E$3:$L$18,MATCH($Y213,CostoParametrico!$D$3:$D$18,0),1)-AB213-AC213)*IF(AND($D$20=\"A\",MID($F213,1,1)<>\"A\"),0%,100%)","v":0},{"$f":"MAX(0,(V213)-INDEX(CostoParametrico!$E$3:$L$18,MATCH($Y213,CostoParametrico!$D$3:$D$18,0),2)-AC213)*IF(AND($D$20=\"A\",MID($F213,1,1)<>\"A\"),0%,100%)","v":0},{"$f":"MAX(0,(V213)-INDEX(CostoParametrico!$E$3:$L$18,MATCH($Y213,CostoParametrico!$D$3:$D$18,0),3))*IF(AND($D$20=\"A\",MID($F213,1,1)<>\"A\"),0%,100%)","v":0},0,{"$f":"MAX(0,(V213+W213)-INDEX(CostoParametrico!$E$3:$L$18,MATCH($Y213,CostoParametrico!$D$3:$D$18,0),1)-AA213-AB213-AC213-AF213-AG213)*IF(AND($D$20=\"A\",MID($F213,1,1)<>\"A\"),0%,100%)","v":0},{"$f":"MAX(0,(V213+W213)-INDEX(CostoParametrico!$E$3:$L$18,MATCH($Y213,CostoParametrico!$D$3:$D$18,0),2)-AB213-AC213-AG213)*IF(AND($D$20=\"A\",MID(F213,1,1)<>\"A\"),0%,100%)","v":0},{"$f":"MAX(0,(V213+W213)-INDEX(CostoParametrico!$E$3:$L$18,MATCH($Y213,CostoParametrico!$D$3:$D$18,0),3)-AC213)*IF(AND($D$20=\"A\",MID(F213,1,1)<>\"A\"),0%,100%)","v":0},{"$f":"INDEX(CostoParametrico!$E$3:$L$18,MATCH($Y213,CostoParametrico!$D$3:$D$18,0),5)","v":400},{"$f":"INDEX(CostoParametrico!$E$3:$L$18,MATCH($Y213,CostoParametrico!$D$3:$D$18,0),6)","v":330},{"$f":"INDEX(CostoParametrico!$E$3:$L$18,MATCH($Y213,CostoParametrico!$D$3:$D$18,0),7)","v":300},{"$f":"INDEX(CostoParametrico!$E$3:$L$18,MATCH($Y213,CostoParametrico!$D$3:$D$18,0),8)","v":300},0,0,0,0,0,0,0,1,0,0,0,0,0,0,0,0,0,0,0,0,0,0,0,0,0,1.1000000000000001]
[1,1,73,1,"N","A - Abitativo",0,0,"Privata",10,"N",0,0,0,0,"N","N","L0",0,0,0,0,0,0,"Abitativa-L0",0,{"$f":"MAX(0,(V214)-INDEX(CostoParametrico!$E$3:$L$18,MATCH($Y214,CostoParametrico!$D$3:$D$18,0),1)-AB214-AC214)*IF(AND($D$20=\"A\",MID($F214,1,1)<>\"A\"),0%,100%)","v":0},{"$f":"MAX(0,(V214)-INDEX(CostoParametrico!$E$3:$L$18,MATCH($Y214,CostoParametrico!$D$3:$D$18,0),2)-AC214)*IF(AND($D$20=\"A\",MID($F214,1,1)<>\"A\"),0%,100%)","v":0},{"$f":"MAX(0,(V214)-INDEX(CostoParametrico!$E$3:$L$18,MATCH($Y214,CostoParametrico!$D$3:$D$18,0),3))*IF(AND($D$20=\"A\",MID($F214,1,1)<>\"A\"),0%,100%)","v":0},0,{"$f":"MAX(0,(V214+W214)-INDEX(CostoParametrico!$E$3:$L$18,MATCH($Y214,CostoParametrico!$D$3:$D$18,0),1)-AA214-AB214-AC214-AF214-AG214)*IF(AND($D$20=\"A\",MID($F214,1,1)<>\"A\"),0%,100%)","v":0},{"$f":"MAX(0,(V214+W214)-INDEX(CostoParametrico!$E$3:$L$18,MATCH($Y214,CostoParametrico!$D$3:$D$18,0),2)-AB214-AC214-AG214)*IF(AND($D$20=\"A\",MID(F214,1,1)<>\"A\"),0%,100%)","v":0},{"$f":"MAX(0,(V214+W214)-INDEX(CostoParametrico!$E$3:$L$18,MATCH($Y214,CostoParametrico!$D$3:$D$18,0),3)-AC214)*IF(AND($D$20=\"A\",MID(F214,1,1)<>\"A\"),0%,100%)","v":0},{"$f":"INDEX(CostoParametrico!$E$3:$L$18,MATCH($Y214,CostoParametrico!$D$3:$D$18,0),5)","v":400},{"$f":"INDEX(CostoParametrico!$E$3:$L$18,MATCH($Y214,CostoParametrico!$D$3:$D$18,0),6)","v":330},{"$f":"INDEX(CostoParametrico!$E$3:$L$18,MATCH($Y214,CostoParametrico!$D$3:$D$18,0),7)","v":300},{"$f":"INDEX(CostoParametrico!$E$3:$L$18,MATCH($Y214,CostoParametrico!$D$3:$D$18,0),8)","v":300},0,0,0,0,0,0,0,1,0,0,0,0,0,0,0,0,0,0,0,0,0,0,0,0,0,1.1000000000000001]
[1,1,74,1,"N","A - Abitativo",0,0,"Privata",10,"N",0,0,0,0,"N","N","L0",0,0,0,0,0,0,"Abitativa-L0",0,{"$f":"MAX(0,(V215)-INDEX(CostoParametrico!$E$3:$L$18,MATCH($Y215,CostoParametrico!$D$3:$D$18,0),1)-AB215-AC215)*IF(AND($D$20=\"A\",MID($F215,1,1)<>\"A\"),0%,100%)","v":0},{"$f":"MAX(0,(V215)-INDEX(CostoParametrico!$E$3:$L$18,MATCH($Y215,CostoParametrico!$D$3:$D$18,0),2)-AC215)*IF(AND($D$20=\"A\",MID($F215,1,1)<>\"A\"),0%,100%)","v":0},{"$f":"MAX(0,(V215)-INDEX(CostoParametrico!$E$3:$L$18,MATCH($Y215,CostoParametrico!$D$3:$D$18,0),3))*IF(AND($D$20=\"A\",MID($F215,1,1)<>\"A\"),0%,100%)","v":0},0,{"$f":"MAX(0,(V215+W215)-INDEX(CostoParametrico!$E$3:$L$18,MATCH($Y215,CostoParametrico!$D$3:$D$18,0),1)-AA215-AB215-AC215-AF215-AG215)*IF(AND($D$20=\"A\",MID($F215,1,1)<>\"A\"),0%,100%)","v":0},{"$f":"MAX(0,(V215+W215)-INDEX(CostoParametrico!$E$3:$L$18,MATCH($Y215,CostoParametrico!$D$3:$D$18,0),2)-AB215-AC215-AG215)*IF(AND($D$20=\"A\",MID(F215,1,1)<>\"A\"),0%,100%)","v":0},{"$f":"MAX(0,(V215+W215)-INDEX(CostoParametrico!$E$3:$L$18,MATCH($Y215,CostoParametrico!$D$3:$D$18,0),3)-AC215)*IF(AND($D$20=\"A\",MID(F215,1,1)<>\"A\"),0%,100%)","v":0},{"$f":"INDEX(CostoParametrico!$E$3:$L$18,MATCH($Y215,CostoParametrico!$D$3:$D$18,0),5)","v":400},{"$f":"INDEX(CostoParametrico!$E$3:$L$18,MATCH($Y215,CostoParametrico!$D$3:$D$18,0),6)","v":330},{"$f":"INDEX(CostoParametrico!$E$3:$L$18,MATCH($Y215,CostoParametrico!$D$3:$D$18,0),7)","v":300},{"$f":"INDEX(CostoParametrico!$E$3:$L$18,MATCH($Y215,CostoParametrico!$D$3:$D$18,0),8)","v":300},0,0,0,0,0,0,0,1,0,0,0,0,0,0,0,0,0,0,0,0,0,0,0,0,0,1.1000000000000001]
[1,1,75,1,"N","A - Abitativo",0,0,"Privata",10,"N",0,0,0,0,"N","N","L0",0,0,0,0,0,0,"Abitativa-L0",0,{"$f":"MAX(0,(V216)-INDEX(CostoParametrico!$E$3:$L$18,MATCH($Y216,CostoParametrico!$D$3:$D$18,0),1)-AB216-AC216)*IF(AND($D$20=\"A\",MID($F216,1,1)<>\"A\"),0%,100%)","v":0},{"$f":"MAX(0,(V216)-INDEX(CostoParametrico!$E$3:$L$18,MATCH($Y216,CostoParametrico!$D$3:$D$18,0),2)-AC216)*IF(AND($D$20=\"A\",MID($F216,1,1)<>\"A\"),0%,100%)","v":0},{"$f":"MAX(0,(V216)-INDEX(CostoParametrico!$E$3:$L$18,MATCH($Y216,CostoParametrico!$D$3:$D$18,0),3))*IF(AND($D$20=\"A\",MID($F216,1,1)<>\"A\"),0%,100%)","v":0},0,{"$f":"MAX(0,(V216+W216)-INDEX(CostoParametrico!$E$3:$L$18,MATCH($Y216,CostoParametrico!$D$3:$D$18,0),1)-AA216-AB216-AC216-AF216-AG216)*IF(AND($D$20=\"A\",MID($F216,1,1)<>\"A\"),0%,100%)","v":0},{"$f":"MAX(0,(V216+W216)-INDEX(CostoParametrico!$E$3:$L$18,MATCH($Y216,CostoParametrico!$D$3:$D$18,0),2)-AB216-AC216-AG216)*IF(AND($D$20=\"A\",MID(F216,1,1)<>\"A\"),0%,100%)","v":0},{"$f":"MAX(0,(V216+W216)-INDEX(CostoParametrico!$E$3:$L$18,MATCH($Y216,CostoParametrico!$D$3:$D$18,0),3)-AC216)*IF(AND($D$20=\"A\",MID(F216,1,1)<>\"A\"),0%,100%)","v":0},{"$f":"INDEX(CostoParametrico!$E$3:$L$18,MATCH($Y216,CostoParametrico!$D$3:$D$18,0),5)","v":400},{"$f":"INDEX(CostoParametrico!$E$3:$L$18,MATCH($Y216,CostoParametrico!$D$3:$D$18,0),6)","v":330},{"$f":"INDEX(CostoParametrico!$E$3:$L$18,MATCH($Y216,CostoParametrico!$D$3:$D$18,0),7)","v":300},{"$f":"INDEX(CostoParametrico!$E$3:$L$18,MATCH($Y216,CostoParametrico!$D$3:$D$18,0),8)","v":300},0,0,0,0,0,0,0,1,0,0,0,0,0,0,0,0,0,0,0,0,0,0,0,0,0,1.1000000000000001]
[1,1,76,1,"N","A - Abitativo",0,0,"Privata",10,"N",0,0,0,0,"N","N","L0",0,0,0,0,0,0,"Abitativa-L0",0,{"$f":"MAX(0,(V217)-INDEX(CostoParametrico!$E$3:$L$18,MATCH($Y217,CostoParametrico!$D$3:$D$18,0),1)-AB217-AC217)*IF(AND($D$20=\"A\",MID($F217,1,1)<>\"A\"),0%,100%)","v":0},{"$f":"MAX(0,(V217)-INDEX(CostoParametrico!$E$3:$L$18,MATCH($Y217,CostoParametrico!$D$3:$D$18,0),2)-AC217)*IF(AND($D$20=\"A\",MID($F217,1,1)<>\"A\"),0%,100%)","v":0},{"$f":"MAX(0,(V217)-INDEX(CostoParametrico!$E$3:$L$18,MATCH($Y217,CostoParametrico!$D$3:$D$18,0),3))*IF(AND($D$20=\"A\",MID($F217,1,1)<>\"A\"),0%,100%)","v":0},0,{"$f":"MAX(0,(V217+W217)-INDEX(CostoParametrico!$E$3:$L$18,MATCH($Y217,CostoParametrico!$D$3:$D$18,0),1)-AA217-AB217-AC217-AF217-AG217)*IF(AND($D$20=\"A\",MID($F217,1,1)<>\"A\"),0%,100%)","v":0},{"$f":"MAX(0,(V217+W217)-INDEX(CostoParametrico!$E$3:$L$18,MATCH($Y217,CostoParametrico!$D$3:$D$18,0),2)-AB217-AC217-AG217)*IF(AND($D$20=\"A\",MID(F217,1,1)<>\"A\"),0%,100%)","v":0},{"$f":"MAX(0,(V217+W217)-INDEX(CostoParametrico!$E$3:$L$18,MATCH($Y217,CostoParametrico!$D$3:$D$18,0),3)-AC217)*IF(AND($D$20=\"A\",MID(F217,1,1)<>\"A\"),0%,100%)","v":0},{"$f":"INDEX(CostoParametrico!$E$3:$L$18,MATCH($Y217,CostoParametrico!$D$3:$D$18,0),5)","v":400},{"$f":"INDEX(CostoParametrico!$E$3:$L$18,MATCH($Y217,CostoParametrico!$D$3:$D$18,0),6)","v":330},{"$f":"INDEX(CostoParametrico!$E$3:$L$18,MATCH($Y217,CostoParametrico!$D$3:$D$18,0),7)","v":300},{"$f":"INDEX(CostoParametrico!$E$3:$L$18,MATCH($Y217,CostoParametrico!$D$3:$D$18,0),8)","v":300},0,0,0,0,0,0,0,1,0,0,0,0,0,0,0,0,0,0,0,0,0,0,0,0,0,1.1000000000000001]
[1,1,77,1,"N","A - Abitativo",0,0,"Privata",10,"N",0,0,0,0,"N","N","L0",0,0,0,0,0,0,"Abitativa-L0",0,{"$f":"MAX(0,(V218)-INDEX(CostoParametrico!$E$3:$L$18,MATCH($Y218,CostoParametrico!$D$3:$D$18,0),1)-AB218-AC218)*IF(AND($D$20=\"A\",MID($F218,1,1)<>\"A\"),0%,100%)","v":0},{"$f":"MAX(0,(V218)-INDEX(CostoParametrico!$E$3:$L$18,MATCH($Y218,CostoParametrico!$D$3:$D$18,0),2)-AC218)*IF(AND($D$20=\"A\",MID($F218,1,1)<>\"A\"),0%,100%)","v":0},{"$f":"MAX(0,(V218)-INDEX(CostoParametrico!$E$3:$L$18,MATCH($Y218,CostoParametrico!$D$3:$D$18,0),3))*IF(AND($D$20=\"A\",MID($F218,1,1)<>\"A\"),0%,100%)","v":0},0,{"$f":"MAX(0,(V218+W218)-INDEX(CostoParametrico!$E$3:$L$18,MATCH($Y218,CostoParametrico!$D$3:$D$18,0),1)-AA218-AB218-AC218-AF218-AG218)*IF(AND($D$20=\"A\",MID($F218,1,1)<>\"A\"),0%,100%)","v":0},{"$f":"MAX(0,(V218+W218)-INDEX(CostoParametrico!$E$3:$L$18,MATCH($Y218,CostoParametrico!$D$3:$D$18,0),2)-AB218-AC218-AG218)*IF(AND($D$20=\"A\",MID(F218,1,1)<>\"A\"),0%,100%)","v":0},{"$f":"MAX(0,(V218+W218)-INDEX(CostoParametrico!$E$3:$L$18,MATCH($Y218,CostoParametrico!$D$3:$D$18,0),3)-AC218)*IF(AND($D$20=\"A\",MID(F218,1,1)<>\"A\"),0%,100%)","v":0},{"$f":"INDEX(CostoParametrico!$E$3:$L$18,MATCH($Y218,CostoParametrico!$D$3:$D$18,0),5)","v":400},{"$f":"INDEX(CostoParametrico!$E$3:$L$18,MATCH($Y218,CostoParametrico!$D$3:$D$18,0),6)","v":330},{"$f":"INDEX(CostoParametrico!$E$3:$L$18,MATCH($Y218,CostoParametrico!$D$3:$D$18,0),7)","v":300},{"$f":"INDEX(CostoParametrico!$E$3:$L$18,MATCH($Y218,CostoParametrico!$D$3:$D$18,0),8)","v":300},0,0,0,0,0,0,0,1,0,0,0,0,0,0,0,0,0,0,0,0,0,0,0,0,0,1.1000000000000001]
[1,1,78,1,"N","A - Abitativo",0,0,"Privata",10,"N",0,0,0,0,"N","N","L0",0,0,0,0,0,0,"Abitativa-L0",0,{"$f":"MAX(0,(V219)-INDEX(CostoParametrico!$E$3:$L$18,MATCH($Y219,CostoParametrico!$D$3:$D$18,0),1)-AB219-AC219)*IF(AND($D$20=\"A\",MID($F219,1,1)<>\"A\"),0%,100%)","v":0},{"$f":"MAX(0,(V219)-INDEX(CostoParametrico!$E$3:$L$18,MATCH($Y219,CostoParametrico!$D$3:$D$18,0),2)-AC219)*IF(AND($D$20=\"A\",MID($F219,1,1)<>\"A\"),0%,100%)","v":0},{"$f":"MAX(0,(V219)-INDEX(CostoParametrico!$E$3:$L$18,MATCH($Y219,CostoParametrico!$D$3:$D$18,0),3))*IF(AND($D$20=\"A\",MID($F219,1,1)<>\"A\"),0%,100%)","v":0},0,{"$f":"MAX(0,(V219+W219)-INDEX(CostoParametrico!$E$3:$L$18,MATCH($Y219,CostoParametrico!$D$3:$D$18,0),1)-AA219-AB219-AC219-AF219-AG219)*IF(AND($D$20=\"A\",MID($F219,1,1)<>\"A\"),0%,100%)","v":0},{"$f":"MAX(0,(V219+W219)-INDEX(CostoParametrico!$E$3:$L$18,MATCH($Y219,CostoParametrico!$D$3:$D$18,0),2)-AB219-AC219-AG219)*IF(AND($D$20=\"A\",MID(F219,1,1)<>\"A\"),0%,100%)","v":0},{"$f":"MAX(0,(V219+W219)-INDEX(CostoParametrico!$E$3:$L$18,MATCH($Y219,CostoParametrico!$D$3:$D$18,0),3)-AC219)*IF(AND($D$20=\"A\",MID(F219,1,1)<>\"A\"),0%,100%)","v":0},{"$f":"INDEX(CostoParametrico!$E$3:$L$18,MATCH($Y219,CostoParametrico!$D$3:$D$18,0),5)","v":400},{"$f":"INDEX(CostoParametrico!$E$3:$L$18,MATCH($Y219,CostoParametrico!$D$3:$D$18,0),6)","v":330},{"$f":"INDEX(CostoParametrico!$E$3:$L$18,MATCH($Y219,CostoParametrico!$D$3:$D$18,0),7)","v":300},{"$f":"INDEX(CostoParametrico!$E$3:$L$18,MATCH($Y219,CostoParametrico!$D$3:$D$18,0),8)","v":300},0,0,0,0,0,0,0,1,0,0,0,0,0,0,0,0,0,0,0,0,0,0,0,0,0,1.1000000000000001]
[1,1,79,1,"N","A - Abitativo",0,0,"Privata",10,"N",0,0,0,0,"N","N","L0",0,0,0,0,0,0,"Abitativa-L0",0,{"$f":"MAX(0,(V220)-INDEX(CostoParametrico!$E$3:$L$18,MATCH($Y220,CostoParametrico!$D$3:$D$18,0),1)-AB220-AC220)*IF(AND($D$20=\"A\",MID($F220,1,1)<>\"A\"),0%,100%)","v":0},{"$f":"MAX(0,(V220)-INDEX(CostoParametrico!$E$3:$L$18,MATCH($Y220,CostoParametrico!$D$3:$D$18,0),2)-AC220)*IF(AND($D$20=\"A\",MID($F220,1,1)<>\"A\"),0%,100%)","v":0},{"$f":"MAX(0,(V220)-INDEX(CostoParametrico!$E$3:$L$18,MATCH($Y220,CostoParametrico!$D$3:$D$18,0),3))*IF(AND($D$20=\"A\",MID($F220,1,1)<>\"A\"),0%,100%)","v":0},0,{"$f":"MAX(0,(V220+W220)-INDEX(CostoParametrico!$E$3:$L$18,MATCH($Y220,CostoParametrico!$D$3:$D$18,0),1)-AA220-AB220-AC220-AF220-AG220)*IF(AND($D$20=\"A\",MID($F220,1,1)<>\"A\"),0%,100%)","v":0},{"$f":"MAX(0,(V220+W220)-INDEX(CostoParametrico!$E$3:$L$18,MATCH($Y220,CostoParametrico!$D$3:$D$18,0),2)-AB220-AC220-AG220)*IF(AND($D$20=\"A\",MID(F220,1,1)<>\"A\"),0%,100%)","v":0},{"$f":"MAX(0,(V220+W220)-INDEX(CostoParametrico!$E$3:$L$18,MATCH($Y220,CostoParametrico!$D$3:$D$18,0),3)-AC220)*IF(AND($D$20=\"A\",MID(F220,1,1)<>\"A\"),0%,100%)","v":0},{"$f":"INDEX(CostoParametrico!$E$3:$L$18,MATCH($Y220,CostoParametrico!$D$3:$D$18,0),5)","v":400},{"$f":"INDEX(CostoParametrico!$E$3:$L$18,MATCH($Y220,CostoParametrico!$D$3:$D$18,0),6)","v":330},{"$f":"INDEX(CostoParametrico!$E$3:$L$18,MATCH($Y220,CostoParametrico!$D$3:$D$18,0),7)","v":300},{"$f":"INDEX(CostoParametrico!$E$3:$L$18,MATCH($Y220,CostoParametrico!$D$3:$D$18,0),8)","v":300},0,0,0,0,0,0,0,1,0,0,0,0,0,0,0,0,0,0,0,0,0,0,0,0,0,1.1000000000000001]
[1,1,80,1,"N","A - Abitativo",0,0,"Privata",10,"N",0,0,0,0,"N","N","L0",0,0,0,0,0,0,"Abitativa-L0",0,{"$f":"MAX(0,(V221)-INDEX(CostoParametrico!$E$3:$L$18,MATCH($Y221,CostoParametrico!$D$3:$D$18,0),1)-AB221-AC221)*IF(AND($D$20=\"A\",MID($F221,1,1)<>\"A\"),0%,100%)","v":0},{"$f":"MAX(0,(V221)-INDEX(CostoParametrico!$E$3:$L$18,MATCH($Y221,CostoParametrico!$D$3:$D$18,0),2)-AC221)*IF(AND($D$20=\"A\",MID($F221,1,1)<>\"A\"),0%,100%)","v":0},{"$f":"MAX(0,(V221)-INDEX(CostoParametrico!$E$3:$L$18,MATCH($Y221,CostoParametrico!$D$3:$D$18,0),3))*IF(AND($D$20=\"A\",MID($F221,1,1)<>\"A\"),0%,100%)","v":0},0,{"$f":"MAX(0,(V221+W221)-INDEX(CostoParametrico!$E$3:$L$18,MATCH($Y221,CostoParametrico!$D$3:$D$18,0),1)-AA221-AB221-AC221-AF221-AG221)*IF(AND($D$20=\"A\",MID($F221,1,1)<>\"A\"),0%,100%)","v":0},{"$f":"MAX(0,(V221+W221)-INDEX(CostoParametrico!$E$3:$L$18,MATCH($Y221,CostoParametrico!$D$3:$D$18,0),2)-AB221-AC221-AG221)*IF(AND($D$20=\"A\",MID(F221,1,1)<>\"A\"),0%,100%)","v":0},{"$f":"MAX(0,(V221+W221)-INDEX(CostoParametrico!$E$3:$L$18,MATCH($Y221,CostoParametrico!$D$3:$D$18,0),3)-AC221)*IF(AND($D$20=\"A\",MID(F221,1,1)<>\"A\"),0%,100%)","v":0},{"$f":"INDEX(CostoParametrico!$E$3:$L$18,MATCH($Y221,CostoParametrico!$D$3:$D$18,0),5)","v":400},{"$f":"INDEX(CostoParametrico!$E$3:$L$18,MATCH($Y221,CostoParametrico!$D$3:$D$18,0),6)","v":330},{"$f":"INDEX(CostoParametrico!$E$3:$L$18,MATCH($Y221,CostoParametrico!$D$3:$D$18,0),7)","v":300},{"$f":"INDEX(CostoParametrico!$E$3:$L$18,MATCH($Y221,CostoParametrico!$D$3:$D$18,0),8)","v":300},0,0,0,0,0,0,0,1,0,0,0,0,0,0,0,0,0,0,0,0,0,0,0,0,0,1.1000000000000001]
[1,1,81,1,"N","A - Abitativo",0,0,"Privata",10,"N",0,0,0,0,"N","N","L0",0,0,0,0,0,0,"Abitativa-L0",0,{"$f":"MAX(0,(V222)-INDEX(CostoParametrico!$E$3:$L$18,MATCH($Y222,CostoParametrico!$D$3:$D$18,0),1)-AB222-AC222)*IF(AND($D$20=\"A\",MID($F222,1,1)<>\"A\"),0%,100%)","v":0},{"$f":"MAX(0,(V222)-INDEX(CostoParametrico!$E$3:$L$18,MATCH($Y222,CostoParametrico!$D$3:$D$18,0),2)-AC222)*IF(AND($D$20=\"A\",MID($F222,1,1)<>\"A\"),0%,100%)","v":0},{"$f":"MAX(0,(V222)-INDEX(CostoParametrico!$E$3:$L$18,MATCH($Y222,CostoParametrico!$D$3:$D$18,0),3))*IF(AND($D$20=\"A\",MID($F222,1,1)<>\"A\"),0%,100%)","v":0},0,{"$f":"MAX(0,(V222+W222)-INDEX(CostoParametrico!$E$3:$L$18,MATCH($Y222,CostoParametrico!$D$3:$D$18,0),1)-AA222-AB222-AC222-AF222-AG222)*IF(AND($D$20=\"A\",MID($F222,1,1)<>\"A\"),0%,100%)","v":0},{"$f":"MAX(0,(V222+W222)-INDEX(CostoParametrico!$E$3:$L$18,MATCH($Y222,CostoParametrico!$D$3:$D$18,0),2)-AB222-AC222-AG222)*IF(AND($D$20=\"A\",MID(F222,1,1)<>\"A\"),0%,100%)","v":0},{"$f":"MAX(0,(V222+W222)-INDEX(CostoParametrico!$E$3:$L$18,MATCH($Y222,CostoParametrico!$D$3:$D$18,0),3)-AC222)*IF(AND($D$20=\"A\",MID(F222,1,1)<>\"A\"),0%,100%)","v":0},{"$f":"INDEX(CostoParametrico!$E$3:$L$18,MATCH($Y222,CostoParametrico!$D$3:$D$18,0),5)","v":400},{"$f":"INDEX(CostoParametrico!$E$3:$L$18,MATCH($Y222,CostoParametrico!$D$3:$D$18,0),6)","v":330},{"$f":"INDEX(CostoParametrico!$E$3:$L$18,MATCH($Y222,CostoParametrico!$D$3:$D$18,0),7)","v":300},{"$f":"INDEX(CostoParametrico!$E$3:$L$18,MATCH($Y222,CostoParametrico!$D$3:$D$18,0),8)","v":300},0,0,0,0,0,0,0,1,0,0,0,0,0,0,0,0,0,0,0,0,0,0,0,0,0,1.1000000000000001]
[1,1,82,1,"N","A - Abitativo",0,0,"Privata",10,"N",0,0,0,0,"N","N","L0",0,0,0,0,0,0,"Abitativa-L0",0,{"$f":"MAX(0,(V223)-INDEX(CostoParametrico!$E$3:$L$18,MATCH($Y223,CostoParametrico!$D$3:$D$18,0),1)-AB223-AC223)*IF(AND($D$20=\"A\",MID($F223,1,1)<>\"A\"),0%,100%)","v":0},{"$f":"MAX(0,(V223)-INDEX(CostoParametrico!$E$3:$L$18,MATCH($Y223,CostoParametrico!$D$3:$D$18,0),2)-AC223)*IF(AND($D$20=\"A\",MID($F223,1,1)<>\"A\"),0%,100%)","v":0},{"$f":"MAX(0,(V223)-INDEX(CostoParametrico!$E$3:$L$18,MATCH($Y223,CostoParametrico!$D$3:$D$18,0),3))*IF(AND($D$20=\"A\",MID($F223,1,1)<>\"A\"),0%,100%)","v":0},0,{"$f":"MAX(0,(V223+W223)-INDEX(CostoParametrico!$E$3:$L$18,MATCH($Y223,CostoParametrico!$D$3:$D$18,0),1)-AA223-AB223-AC223-AF223-AG223)*IF(AND($D$20=\"A\",MID($F223,1,1)<>\"A\"),0%,100%)","v":0},{"$f":"MAX(0,(V223+W223)-INDEX(CostoParametrico!$E$3:$L$18,MATCH($Y223,CostoParametrico!$D$3:$D$18,0),2)-AB223-AC223-AG223)*IF(AND($D$20=\"A\",MID(F223,1,1)<>\"A\"),0%,100%)","v":0},{"$f":"MAX(0,(V223+W223)-INDEX(CostoParametrico!$E$3:$L$18,MATCH($Y223,CostoParametrico!$D$3:$D$18,0),3)-AC223)*IF(AND($D$20=\"A\",MID(F223,1,1)<>\"A\"),0%,100%)","v":0},{"$f":"INDEX(CostoParametrico!$E$3:$L$18,MATCH($Y223,CostoParametrico!$D$3:$D$18,0),5)","v":400},{"$f":"INDEX(CostoParametrico!$E$3:$L$18,MATCH($Y223,CostoParametrico!$D$3:$D$18,0),6)","v":330},{"$f":"INDEX(CostoParametrico!$E$3:$L$18,MATCH($Y223,CostoParametrico!$D$3:$D$18,0),7)","v":300},{"$f":"INDEX(CostoParametrico!$E$3:$L$18,MATCH($Y223,CostoParametrico!$D$3:$D$18,0),8)","v":300},0,0,0,0,0,0,0,1,0,0,0,0,0,0,0,0,0,0,0,0,0,0,0,0,0,1.1000000000000001]
[1,1,83,1,"N","A - Abitativo",0,0,"Privata",10,"N",0,0,0,0,"N","N","L0",0,0,0,0,0,0,"Abitativa-L0",0,{"$f":"MAX(0,(V224)-INDEX(CostoParametrico!$E$3:$L$18,MATCH($Y224,CostoParametrico!$D$3:$D$18,0),1)-AB224-AC224)*IF(AND($D$20=\"A\",MID($F224,1,1)<>\"A\"),0%,100%)","v":0},{"$f":"MAX(0,(V224)-INDEX(CostoParametrico!$E$3:$L$18,MATCH($Y224,CostoParametrico!$D$3:$D$18,0),2)-AC224)*IF(AND($D$20=\"A\",MID($F224,1,1)<>\"A\"),0%,100%)","v":0},{"$f":"MAX(0,(V224)-INDEX(CostoParametrico!$E$3:$L$18,MATCH($Y224,CostoParametrico!$D$3:$D$18,0),3))*IF(AND($D$20=\"A\",MID($F224,1,1)<>\"A\"),0%,100%)","v":0},0,{"$f":"MAX(0,(V224+W224)-INDEX(CostoParametrico!$E$3:$L$18,MATCH($Y224,CostoParametrico!$D$3:$D$18,0),1)-AA224-AB224-AC224-AF224-AG224)*IF(AND($D$20=\"A\",MID($F224,1,1)<>\"A\"),0%,100%)","v":0},{"$f":"MAX(0,(V224+W224)-INDEX(CostoParametrico!$E$3:$L$18,MATCH($Y224,CostoParametrico!$D$3:$D$18,0),2)-AB224-AC224-AG224)*IF(AND($D$20=\"A\",MID(F224,1,1)<>\"A\"),0%,100%)","v":0},{"$f":"MAX(0,(V224+W224)-INDEX(CostoParametrico!$E$3:$L$18,MATCH($Y224,CostoParametrico!$D$3:$D$18,0),3)-AC224)*IF(AND($D$20=\"A\",MID(F224,1,1)<>\"A\"),0%,100%)","v":0},{"$f":"INDEX(CostoParametrico!$E$3:$L$18,MATCH($Y224,CostoParametrico!$D$3:$D$18,0),5)","v":400},{"$f":"INDEX(CostoParametrico!$E$3:$L$18,MATCH($Y224,CostoParametrico!$D$3:$D$18,0),6)","v":330},{"$f":"INDEX(CostoParametrico!$E$3:$L$18,MATCH($Y224,CostoParametrico!$D$3:$D$18,0),7)","v":300},{"$f":"INDEX(CostoParametrico!$E$3:$L$18,MATCH($Y224,CostoParametrico!$D$3:$D$18,0),8)","v":300},0,0,0,0,0,0,0,1,0,0,0,0,0,0,0,0,0,0,0,0,0,0,0,0,0,1.1000000000000001]
[1,1,84,1,"N","A - Abitativo",0,0,"Privata",10,"N",0,0,0,0,"N","N","L0",0,0,0,0,0,0,"Abitativa-L0",0,{"$f":"MAX(0,(V225)-INDEX(CostoParametrico!$E$3:$L$18,MATCH($Y225,CostoParametrico!$D$3:$D$18,0),1)-AB225-AC225)*IF(AND($D$20=\"A\",MID($F225,1,1)<>\"A\"),0%,100%)","v":0},{"$f":"MAX(0,(V225)-INDEX(CostoParametrico!$E$3:$L$18,MATCH($Y225,CostoParametrico!$D$3:$D$18,0),2)-AC225)*IF(AND($D$20=\"A\",MID($F225,1,1)<>\"A\"),0%,100%)","v":0},{"$f":"MAX(0,(V225)-INDEX(CostoParametrico!$E$3:$L$18,MATCH($Y225,CostoParametrico!$D$3:$D$18,0),3))*IF(AND($D$20=\"A\",MID($F225,1,1)<>\"A\"),0%,100%)","v":0},0,{"$f":"MAX(0,(V225+W225)-INDEX(CostoParametrico!$E$3:$L$18,MATCH($Y225,CostoParametrico!$D$3:$D$18,0),1)-AA225-AB225-AC225-AF225-AG225)*IF(AND($D$20=\"A\",MID($F225,1,1)<>\"A\"),0%,100%)","v":0},{"$f":"MAX(0,(V225+W225)-INDEX(CostoParametrico!$E$3:$L$18,MATCH($Y225,CostoParametrico!$D$3:$D$18,0),2)-AB225-AC225-AG225)*IF(AND($D$20=\"A\",MID(F225,1,1)<>\"A\"),0%,100%)","v":0},{"$f":"MAX(0,(V225+W225)-INDEX(CostoParametrico!$E$3:$L$18,MATCH($Y225,CostoParametrico!$D$3:$D$18,0),3)-AC225)*IF(AND($D$20=\"A\",MID(F225,1,1)<>\"A\"),0%,100%)","v":0},{"$f":"INDEX(CostoParametrico!$E$3:$L$18,MATCH($Y225,CostoParametrico!$D$3:$D$18,0),5)","v":400},{"$f":"INDEX(CostoParametrico!$E$3:$L$18,MATCH($Y225,CostoParametrico!$D$3:$D$18,0),6)","v":330},{"$f":"INDEX(CostoParametrico!$E$3:$L$18,MATCH($Y225,CostoParametrico!$D$3:$D$18,0),7)","v":300},{"$f":"INDEX(CostoParametrico!$E$3:$L$18,MATCH($Y225,CostoParametrico!$D$3:$D$18,0),8)","v":300},0,0,0,0,0,0,0,1,0,0,0,0,0,0,0,0,0,0,0,0,0,0,0,0,0,1.1000000000000001]
[1,1,85,1,"N","A - Abitativo",0,0,"Privata",10,"N",0,0,0,0,"N","N","L0",0,0,0,0,0,0,"Abitativa-L0",0,{"$f":"MAX(0,(V226)-INDEX(CostoParametrico!$E$3:$L$18,MATCH($Y226,CostoParametrico!$D$3:$D$18,0),1)-AB226-AC226)*IF(AND($D$20=\"A\",MID($F226,1,1)<>\"A\"),0%,100%)","v":0},{"$f":"MAX(0,(V226)-INDEX(CostoParametrico!$E$3:$L$18,MATCH($Y226,CostoParametrico!$D$3:$D$18,0),2)-AC226)*IF(AND($D$20=\"A\",MID($F226,1,1)<>\"A\"),0%,100%)","v":0},{"$f":"MAX(0,(V226)-INDEX(CostoParametrico!$E$3:$L$18,MATCH($Y226,CostoParametrico!$D$3:$D$18,0),3))*IF(AND($D$20=\"A\",MID($F226,1,1)<>\"A\"),0%,100%)","v":0},0,{"$f":"MAX(0,(V226+W226)-INDEX(CostoParametrico!$E$3:$L$18,MATCH($Y226,CostoParametrico!$D$3:$D$18,0),1)-AA226-AB226-AC226-AF226-AG226)*IF(AND($D$20=\"A\",MID($F226,1,1)<>\"A\"),0%,100%)","v":0},{"$f":"MAX(0,(V226+W226)-INDEX(CostoParametrico!$E$3:$L$18,MATCH($Y226,CostoParametrico!$D$3:$D$18,0),2)-AB226-AC226-AG226)*IF(AND($D$20=\"A\",MID(F226,1,1)<>\"A\"),0%,100%)","v":0},{"$f":"MAX(0,(V226+W226)-INDEX(CostoParametrico!$E$3:$L$18,MATCH($Y226,CostoParametrico!$D$3:$D$18,0),3)-AC226)*IF(AND($D$20=\"A\",MID(F226,1,1)<>\"A\"),0%,100%)","v":0},{"$f":"INDEX(CostoParametrico!$E$3:$L$18,MATCH($Y226,CostoParametrico!$D$3:$D$18,0),5)","v":400},{"$f":"INDEX(CostoParametrico!$E$3:$L$18,MATCH($Y226,CostoParametrico!$D$3:$D$18,0),6)","v":330},{"$f":"INDEX(CostoParametrico!$E$3:$L$18,MATCH($Y226,CostoParametrico!$D$3:$D$18,0),7)","v":300},{"$f":"INDEX(CostoParametrico!$E$3:$L$18,MATCH($Y226,CostoParametrico!$D$3:$D$18,0),8)","v":300},0,0,0,0,0,0,0,1,0,0,0,0,0,0,0,0,0,0,0,0,0,0,0,0,0,1.1000000000000001]
[1,1,86,1,"N","A - Abitativo",0,0,"Privata",10,"N",0,0,0,0,"N","N","L0",0,0,0,0,0,0,"Abitativa-L0",0,{"$f":"MAX(0,(V227)-INDEX(CostoParametrico!$E$3:$L$18,MATCH($Y227,CostoParametrico!$D$3:$D$18,0),1)-AB227-AC227)*IF(AND($D$20=\"A\",MID($F227,1,1)<>\"A\"),0%,100%)","v":0},{"$f":"MAX(0,(V227)-INDEX(CostoParametrico!$E$3:$L$18,MATCH($Y227,CostoParametrico!$D$3:$D$18,0),2)-AC227)*IF(AND($D$20=\"A\",MID($F227,1,1)<>\"A\"),0%,100%)","v":0},{"$f":"MAX(0,(V227)-INDEX(CostoParametrico!$E$3:$L$18,MATCH($Y227,CostoParametrico!$D$3:$D$18,0),3))*IF(AND($D$20=\"A\",MID($F227,1,1)<>\"A\"),0%,100%)","v":0},0,{"$f":"MAX(0,(V227+W227)-INDEX(CostoParametrico!$E$3:$L$18,MATCH($Y227,CostoParametrico!$D$3:$D$18,0),1)-AA227-AB227-AC227-AF227-AG227)*IF(AND($D$20=\"A\",MID($F227,1,1)<>\"A\"),0%,100%)","v":0},{"$f":"MAX(0,(V227+W227)-INDEX(CostoParametrico!$E$3:$L$18,MATCH($Y227,CostoParametrico!$D$3:$D$18,0),2)-AB227-AC227-AG227)*IF(AND($D$20=\"A\",MID(F227,1,1)<>\"A\"),0%,100%)","v":0},{"$f":"MAX(0,(V227+W227)-INDEX(CostoParametrico!$E$3:$L$18,MATCH($Y227,CostoParametrico!$D$3:$D$18,0),3)-AC227)*IF(AND($D$20=\"A\",MID(F227,1,1)<>\"A\"),0%,100%)","v":0},{"$f":"INDEX(CostoParametrico!$E$3:$L$18,MATCH($Y227,CostoParametrico!$D$3:$D$18,0),5)","v":400},{"$f":"INDEX(CostoParametrico!$E$3:$L$18,MATCH($Y227,CostoParametrico!$D$3:$D$18,0),6)","v":330},{"$f":"INDEX(CostoParametrico!$E$3:$L$18,MATCH($Y227,CostoParametrico!$D$3:$D$18,0),7)","v":300},{"$f":"INDEX(CostoParametrico!$E$3:$L$18,MATCH($Y227,CostoParametrico!$D$3:$D$18,0),8)","v":300},0,0,0,0,0,0,0,1,0,0,0,0,0,0,0,0,0,0,0,0,0,0,0,0,0,1.1000000000000001]
[1,1,87,1,"N","A - Abitativo",0,0,"Privata",10,"N",0,0,0,0,"N","N","L0",0,0,0,0,0,0,"Abitativa-L0",0,{"$f":"MAX(0,(V228)-INDEX(CostoParametrico!$E$3:$L$18,MATCH($Y228,CostoParametrico!$D$3:$D$18,0),1)-AB228-AC228)*IF(AND($D$20=\"A\",MID($F228,1,1)<>\"A\"),0%,100%)","v":0},{"$f":"MAX(0,(V228)-INDEX(CostoParametrico!$E$3:$L$18,MATCH($Y228,CostoParametrico!$D$3:$D$18,0),2)-AC228)*IF(AND($D$20=\"A\",MID($F228,1,1)<>\"A\"),0%,100%)","v":0},{"$f":"MAX(0,(V228)-INDEX(CostoParametrico!$E$3:$L$18,MATCH($Y228,CostoParametrico!$D$3:$D$18,0),3))*IF(AND($D$20=\"A\",MID($F228,1,1)<>\"A\"),0%,100%)","v":0},0,{"$f":"MAX(0,(V228+W228)-INDEX(CostoParametrico!$E$3:$L$18,MATCH($Y228,CostoParametrico!$D$3:$D$18,0),1)-AA228-AB228-AC228-AF228-AG228)*IF(AND($D$20=\"A\",MID($F228,1,1)<>\"A\"),0%,100%)","v":0},{"$f":"MAX(0,(V228+W228)-INDEX(CostoParametrico!$E$3:$L$18,MATCH($Y228,CostoParametrico!$D$3:$D$18,0),2)-AB228-AC228-AG228)*IF(AND($D$20=\"A\",MID(F228,1,1)<>\"A\"),0%,100%)","v":0},{"$f":"MAX(0,(V228+W228)-INDEX(CostoParametrico!$E$3:$L$18,MATCH($Y228,CostoParametrico!$D$3:$D$18,0),3)-AC228)*IF(AND($D$20=\"A\",MID(F228,1,1)<>\"A\"),0%,100%)","v":0},{"$f":"INDEX(CostoParametrico!$E$3:$L$18,MATCH($Y228,CostoParametrico!$D$3:$D$18,0),5)","v":400},{"$f":"INDEX(CostoParametrico!$E$3:$L$18,MATCH($Y228,CostoParametrico!$D$3:$D$18,0),6)","v":330},{"$f":"INDEX(CostoParametrico!$E$3:$L$18,MATCH($Y228,CostoParametrico!$D$3:$D$18,0),7)","v":300},{"$f":"INDEX(CostoParametrico!$E$3:$L$18,MATCH($Y228,CostoParametrico!$D$3:$D$18,0),8)","v":300},0,0,0,0,0,0,0,1,0,0,0,0,0,0,0,0,0,0,0,0,0,0,0,0,0,1.1000000000000001]
[1,1,88,1,"N","A - Abitativo",0,0,"Privata",10,"N",0,0,0,0,"N","N","L0",0,0,0,0,0,0,"Abitativa-L0",0,{"$f":"MAX(0,(V229)-INDEX(CostoParametrico!$E$3:$L$18,MATCH($Y229,CostoParametrico!$D$3:$D$18,0),1)-AB229-AC229)*IF(AND($D$20=\"A\",MID($F229,1,1)<>\"A\"),0%,100%)","v":0},{"$f":"MAX(0,(V229)-INDEX(CostoParametrico!$E$3:$L$18,MATCH($Y229,CostoParametrico!$D$3:$D$18,0),2)-AC229)*IF(AND($D$20=\"A\",MID($F229,1,1)<>\"A\"),0%,100%)","v":0},{"$f":"MAX(0,(V229)-INDEX(CostoParametrico!$E$3:$L$18,MATCH($Y229,CostoParametrico!$D$3:$D$18,0),3))*IF(AND($D$20=\"A\",MID($F229,1,1)<>\"A\"),0%,100%)","v":0},0,{"$f":"MAX(0,(V229+W229)-INDEX(CostoParametrico!$E$3:$L$18,MATCH($Y229,CostoParametrico!$D$3:$D$18,0),1)-AA229-AB229-AC229-AF229-AG229)*IF(AND($D$20=\"A\",MID($F229,1,1)<>\"A\"),0%,100%)","v":0},{"$f":"MAX(0,(V229+W229)-INDEX(CostoParametrico!$E$3:$L$18,MATCH($Y229,CostoParametrico!$D$3:$D$18,0),2)-AB229-AC229-AG229)*IF(AND($D$20=\"A\",MID(F229,1,1)<>\"A\"),0%,100%)","v":0},{"$f":"MAX(0,(V229+W229)-INDEX(CostoParametrico!$E$3:$L$18,MATCH($Y229,CostoParametrico!$D$3:$D$18,0),3)-AC229)*IF(AND($D$20=\"A\",MID(F229,1,1)<>\"A\"),0%,100%)","v":0},{"$f":"INDEX(CostoParametrico!$E$3:$L$18,MATCH($Y229,CostoParametrico!$D$3:$D$18,0),5)","v":400},{"$f":"INDEX(CostoParametrico!$E$3:$L$18,MATCH($Y229,CostoParametrico!$D$3:$D$18,0),6)","v":330},{"$f":"INDEX(CostoParametrico!$E$3:$L$18,MATCH($Y229,CostoParametrico!$D$3:$D$18,0),7)","v":300},{"$f":"INDEX(CostoParametrico!$E$3:$L$18,MATCH($Y229,CostoParametrico!$D$3:$D$18,0),8)","v":300},0,0,0,0,0,0,0,1,0,0,0,0,0,0,0,0,0,0,0,0,0,0,0,0,0,1.1000000000000001]
[1,1,89,1,"N","A - Abitativo",0,0,"Privata",10,"N",0,0,0,0,"N","N","L0",0,0,0,0,0,0,"Abitativa-L0",0,{"$f":"MAX(0,(V230)-INDEX(CostoParametrico!$E$3:$L$18,MATCH($Y230,CostoParametrico!$D$3:$D$18,0),1)-AB230-AC230)*IF(AND($D$20=\"A\",MID($F230,1,1)<>\"A\"),0%,100%)","v":0},{"$f":"MAX(0,(V230)-INDEX(CostoParametrico!$E$3:$L$18,MATCH($Y230,CostoParametrico!$D$3:$D$18,0),2)-AC230)*IF(AND($D$20=\"A\",MID($F230,1,1)<>\"A\"),0%,100%)","v":0},{"$f":"MAX(0,(V230)-INDEX(CostoParametrico!$E$3:$L$18,MATCH($Y230,CostoParametrico!$D$3:$D$18,0),3))*IF(AND($D$20=\"A\",MID($F230,1,1)<>\"A\"),0%,100%)","v":0},0,{"$f":"MAX(0,(V230+W230)-INDEX(CostoParametrico!$E$3:$L$18,MATCH($Y230,CostoParametrico!$D$3:$D$18,0),1)-AA230-AB230-AC230-AF230-AG230)*IF(AND($D$20=\"A\",MID($F230,1,1)<>\"A\"),0%,100%)","v":0},{"$f":"MAX(0,(V230+W230)-INDEX(CostoParametrico!$E$3:$L$18,MATCH($Y230,CostoParametrico!$D$3:$D$18,0),2)-AB230-AC230-AG230)*IF(AND($D$20=\"A\",MID(F230,1,1)<>\"A\"),0%,100%)","v":0},{"$f":"MAX(0,(V230+W230)-INDEX(CostoParametrico!$E$3:$L$18,MATCH($Y230,CostoParametrico!$D$3:$D$18,0),3)-AC230)*IF(AND($D$20=\"A\",MID(F230,1,1)<>\"A\"),0%,100%)","v":0},{"$f":"INDEX(CostoParametrico!$E$3:$L$18,MATCH($Y230,CostoParametrico!$D$3:$D$18,0),5)","v":400},{"$f":"INDEX(CostoParametrico!$E$3:$L$18,MATCH($Y230,CostoParametrico!$D$3:$D$18,0),6)","v":330},{"$f":"INDEX(CostoParametrico!$E$3:$L$18,MATCH($Y230,CostoParametrico!$D$3:$D$18,0),7)","v":300},{"$f":"INDEX(CostoParametrico!$E$3:$L$18,MATCH($Y230,CostoParametrico!$D$3:$D$18,0),8)","v":300},0,0,0,0,0,0,0,1,0,0,0,0,0,0,0,0,0,0,0,0,0,0,0,0,0,1.1000000000000001]
[1,1,90,1,"N","A - Abitativo",0,0,"Privata",10,"N",0,0,0,0,"N","N","L0",0,0,0,0,0,0,"Abitativa-L0",0,{"$f":"MAX(0,(V231)-INDEX(CostoParametrico!$E$3:$L$18,MATCH($Y231,CostoParametrico!$D$3:$D$18,0),1)-AB231-AC231)*IF(AND($D$20=\"A\",MID($F231,1,1)<>\"A\"),0%,100%)","v":0},{"$f":"MAX(0,(V231)-INDEX(CostoParametrico!$E$3:$L$18,MATCH($Y231,CostoParametrico!$D$3:$D$18,0),2)-AC231)*IF(AND($D$20=\"A\",MID($F231,1,1)<>\"A\"),0%,100%)","v":0},{"$f":"MAX(0,(V231)-INDEX(CostoParametrico!$E$3:$L$18,MATCH($Y231,CostoParametrico!$D$3:$D$18,0),3))*IF(AND($D$20=\"A\",MID($F231,1,1)<>\"A\"),0%,100%)","v":0},0,{"$f":"MAX(0,(V231+W231)-INDEX(CostoParametrico!$E$3:$L$18,MATCH($Y231,CostoParametrico!$D$3:$D$18,0),1)-AA231-AB231-AC231-AF231-AG231)*IF(AND($D$20=\"A\",MID($F231,1,1)<>\"A\"),0%,100%)","v":0},{"$f":"MAX(0,(V231+W231)-INDEX(CostoParametrico!$E$3:$L$18,MATCH($Y231,CostoParametrico!$D$3:$D$18,0),2)-AB231-AC231-AG231)*IF(AND($D$20=\"A\",MID(F231,1,1)<>\"A\"),0%,100%)","v":0},{"$f":"MAX(0,(V231+W231)-INDEX(CostoParametrico!$E$3:$L$18,MATCH($Y231,CostoParametrico!$D$3:$D$18,0),3)-AC231)*IF(AND($D$20=\"A\",MID(F231,1,1)<>\"A\"),0%,100%)","v":0},{"$f":"INDEX(CostoParametrico!$E$3:$L$18,MATCH($Y231,CostoParametrico!$D$3:$D$18,0),5)","v":400},{"$f":"INDEX(CostoParametrico!$E$3:$L$18,MATCH($Y231,CostoParametrico!$D$3:$D$18,0),6)","v":330},{"$f":"INDEX(CostoParametrico!$E$3:$L$18,MATCH($Y231,CostoParametrico!$D$3:$D$18,0),7)","v":300},{"$f":"INDEX(CostoParametrico!$E$3:$L$18,MATCH($Y231,CostoParametrico!$D$3:$D$18,0),8)","v":300},0,0,0,0,0,0,0,1,0,0,0,0,0,0,0,0,0,0,0,0,0,0,0,0,0,1.1000000000000001]
[1,1,91,1,"N","A - Abitativo",0,0,"Privata",10,"N",0,0,0,0,"N","N","L0",0,0,0,0,0,0,"Abitativa-L0",0,{"$f":"MAX(0,(V232)-INDEX(CostoParametrico!$E$3:$L$18,MATCH($Y232,CostoParametrico!$D$3:$D$18,0),1)-AB232-AC232)*IF(AND($D$20=\"A\",MID($F232,1,1)<>\"A\"),0%,100%)","v":0},{"$f":"MAX(0,(V232)-INDEX(CostoParametrico!$E$3:$L$18,MATCH($Y232,CostoParametrico!$D$3:$D$18,0),2)-AC232)*IF(AND($D$20=\"A\",MID($F232,1,1)<>\"A\"),0%,100%)","v":0},{"$f":"MAX(0,(V232)-INDEX(CostoParametrico!$E$3:$L$18,MATCH($Y232,CostoParametrico!$D$3:$D$18,0),3))*IF(AND($D$20=\"A\",MID($F232,1,1)<>\"A\"),0%,100%)","v":0},0,{"$f":"MAX(0,(V232+W232)-INDEX(CostoParametrico!$E$3:$L$18,MATCH($Y232,CostoParametrico!$D$3:$D$18,0),1)-AA232-AB232-AC232-AF232-AG232)*IF(AND($D$20=\"A\",MID($F232,1,1)<>\"A\"),0%,100%)","v":0},{"$f":"MAX(0,(V232+W232)-INDEX(CostoParametrico!$E$3:$L$18,MATCH($Y232,CostoParametrico!$D$3:$D$18,0),2)-AB232-AC232-AG232)*IF(AND($D$20=\"A\",MID(F232,1,1)<>\"A\"),0%,100%)","v":0},{"$f":"MAX(0,(V232+W232)-INDEX(CostoParametrico!$E$3:$L$18,MATCH($Y232,CostoParametrico!$D$3:$D$18,0),3)-AC232)*IF(AND($D$20=\"A\",MID(F232,1,1)<>\"A\"),0%,100%)","v":0},{"$f":"INDEX(CostoParametrico!$E$3:$L$18,MATCH($Y232,CostoParametrico!$D$3:$D$18,0),5)","v":400},{"$f":"INDEX(CostoParametrico!$E$3:$L$18,MATCH($Y232,CostoParametrico!$D$3:$D$18,0),6)","v":330},{"$f":"INDEX(CostoParametrico!$E$3:$L$18,MATCH($Y232,CostoParametrico!$D$3:$D$18,0),7)","v":300},{"$f":"INDEX(CostoParametrico!$E$3:$L$18,MATCH($Y232,CostoParametrico!$D$3:$D$18,0),8)","v":300},0,0,0,0,0,0,0,1,0,0,0,0,0,0,0,0,0,0,0,0,0,0,0,0,0,1.1000000000000001]
[1,1,92,1,"N","A - Abitativo",0,0,"Privata",10,"N",0,0,0,0,"N","N","L0",0,0,0,0,0,0,"Abitativa-L0",0,{"$f":"MAX(0,(V233)-INDEX(CostoParametrico!$E$3:$L$18,MATCH($Y233,CostoParametrico!$D$3:$D$18,0),1)-AB233-AC233)*IF(AND($D$20=\"A\",MID($F233,1,1)<>\"A\"),0%,100%)","v":0},{"$f":"MAX(0,(V233)-INDEX(CostoParametrico!$E$3:$L$18,MATCH($Y233,CostoParametrico!$D$3:$D$18,0),2)-AC233)*IF(AND($D$20=\"A\",MID($F233,1,1)<>\"A\"),0%,100%)","v":0},{"$f":"MAX(0,(V233)-INDEX(CostoParametrico!$E$3:$L$18,MATCH($Y233,CostoParametrico!$D$3:$D$18,0),3))*IF(AND($D$20=\"A\",MID($F233,1,1)<>\"A\"),0%,100%)","v":0},0,{"$f":"MAX(0,(V233+W233)-INDEX(CostoParametrico!$E$3:$L$18,MATCH($Y233,CostoParametrico!$D$3:$D$18,0),1)-AA233-AB233-AC233-AF233-AG233)*IF(AND($D$20=\"A\",MID($F233,1,1)<>\"A\"),0%,100%)","v":0},{"$f":"MAX(0,(V233+W233)-INDEX(CostoParametrico!$E$3:$L$18,MATCH($Y233,CostoParametrico!$D$3:$D$18,0),2)-AB233-AC233-AG233)*IF(AND($D$20=\"A\",MID(F233,1,1)<>\"A\"),0%,100%)","v":0},{"$f":"MAX(0,(V233+W233)-INDEX(CostoParametrico!$E$3:$L$18,MATCH($Y233,CostoParametrico!$D$3:$D$18,0),3)-AC233)*IF(AND($D$20=\"A\",MID(F233,1,1)<>\"A\"),0%,100%)","v":0},{"$f":"INDEX(CostoParametrico!$E$3:$L$18,MATCH($Y233,CostoParametrico!$D$3:$D$18,0),5)","v":400},{"$f":"INDEX(CostoParametrico!$E$3:$L$18,MATCH($Y233,CostoParametrico!$D$3:$D$18,0),6)","v":330},{"$f":"INDEX(CostoParametrico!$E$3:$L$18,MATCH($Y233,CostoParametrico!$D$3:$D$18,0),7)","v":300},{"$f":"INDEX(CostoParametrico!$E$3:$L$18,MATCH($Y233,CostoParametrico!$D$3:$D$18,0),8)","v":300},0,0,0,0,0,0,0,1,0,0,0,0,0,0,0,0,0,0,0,0,0,0,0,0,0,1.1000000000000001]
[1,1,93,1,"N","A - Abitativo",0,0,"Privata",10,"N",0,0,0,0,"N","N","L0",0,0,0,0,0,0,"Abitativa-L0",0,{"$f":"MAX(0,(V234)-INDEX(CostoParametrico!$E$3:$L$18,MATCH($Y234,CostoParametrico!$D$3:$D$18,0),1)-AB234-AC234)*IF(AND($D$20=\"A\",MID($F234,1,1)<>\"A\"),0%,100%)","v":0},{"$f":"MAX(0,(V234)-INDEX(CostoParametrico!$E$3:$L$18,MATCH($Y234,CostoParametrico!$D$3:$D$18,0),2)-AC234)*IF(AND($D$20=\"A\",MID($F234,1,1)<>\"A\"),0%,100%)","v":0},{"$f":"MAX(0,(V234)-INDEX(CostoParametrico!$E$3:$L$18,MATCH($Y234,CostoParametrico!$D$3:$D$18,0),3))*IF(AND($D$20=\"A\",MID($F234,1,1)<>\"A\"),0%,100%)","v":0},0,{"$f":"MAX(0,(V234+W234)-INDEX(CostoParametrico!$E$3:$L$18,MATCH($Y234,CostoParametrico!$D$3:$D$18,0),1)-AA234-AB234-AC234-AF234-AG234)*IF(AND($D$20=\"A\",MID($F234,1,1)<>\"A\"),0%,100%)","v":0},{"$f":"MAX(0,(V234+W234)-INDEX(CostoParametrico!$E$3:$L$18,MATCH($Y234,CostoParametrico!$D$3:$D$18,0),2)-AB234-AC234-AG234)*IF(AND($D$20=\"A\",MID(F234,1,1)<>\"A\"),0%,100%)","v":0},{"$f":"MAX(0,(V234+W234)-INDEX(CostoParametrico!$E$3:$L$18,MATCH($Y234,CostoParametrico!$D$3:$D$18,0),3)-AC234)*IF(AND($D$20=\"A\",MID(F234,1,1)<>\"A\"),0%,100%)","v":0},{"$f":"INDEX(CostoParametrico!$E$3:$L$18,MATCH($Y234,CostoParametrico!$D$3:$D$18,0),5)","v":400},{"$f":"INDEX(CostoParametrico!$E$3:$L$18,MATCH($Y234,CostoParametrico!$D$3:$D$18,0),6)","v":330},{"$f":"INDEX(CostoParametrico!$E$3:$L$18,MATCH($Y234,CostoParametrico!$D$3:$D$18,0),7)","v":300},{"$f":"INDEX(CostoParametrico!$E$3:$L$18,MATCH($Y234,CostoParametrico!$D$3:$D$18,0),8)","v":300},0,0,0,0,0,0,0,1,0,0,0,0,0,0,0,0,0,0,0,0,0,0,0,0,0,1.1000000000000001]
[1,1,94,1,"N","A - Abitativo",0,0,"Privata",10,"N",0,0,0,0,"N","N","L0",0,0,0,0,0,0,"Abitativa-L0",0,{"$f":"MAX(0,(V235)-INDEX(CostoParametrico!$E$3:$L$18,MATCH($Y235,CostoParametrico!$D$3:$D$18,0),1)-AB235-AC235)*IF(AND($D$20=\"A\",MID($F235,1,1)<>\"A\"),0%,100%)","v":0},{"$f":"MAX(0,(V235)-INDEX(CostoParametrico!$E$3:$L$18,MATCH($Y235,CostoParametrico!$D$3:$D$18,0),2)-AC235)*IF(AND($D$20=\"A\",MID($F235,1,1)<>\"A\"),0%,100%)","v":0},{"$f":"MAX(0,(V235)-INDEX(CostoParametrico!$E$3:$L$18,MATCH($Y235,CostoParametrico!$D$3:$D$18,0),3))*IF(AND($D$20=\"A\",MID($F235,1,1)<>\"A\"),0%,100%)","v":0},0,{"$f":"MAX(0,(V235+W235)-INDEX(CostoParametrico!$E$3:$L$18,MATCH($Y235,CostoParametrico!$D$3:$D$18,0),1)-AA235-AB235-AC235-AF235-AG235)*IF(AND($D$20=\"A\",MID($F235,1,1)<>\"A\"),0%,100%)","v":0},{"$f":"MAX(0,(V235+W235)-INDEX(CostoParametrico!$E$3:$L$18,MATCH($Y235,CostoParametrico!$D$3:$D$18,0),2)-AB235-AC235-AG235)*IF(AND($D$20=\"A\",MID(F235,1,1)<>\"A\"),0%,100%)","v":0},{"$f":"MAX(0,(V235+W235)-INDEX(CostoParametrico!$E$3:$L$18,MATCH($Y235,CostoParametrico!$D$3:$D$18,0),3)-AC235)*IF(AND($D$20=\"A\",MID(F235,1,1)<>\"A\"),0%,100%)","v":0},{"$f":"INDEX(CostoParametrico!$E$3:$L$18,MATCH($Y235,CostoParametrico!$D$3:$D$18,0),5)","v":400},{"$f":"INDEX(CostoParametrico!$E$3:$L$18,MATCH($Y235,CostoParametrico!$D$3:$D$18,0),6)","v":330},{"$f":"INDEX(CostoParametrico!$E$3:$L$18,MATCH($Y235,CostoParametrico!$D$3:$D$18,0),7)","v":300},{"$f":"INDEX(CostoParametrico!$E$3:$L$18,MATCH($Y235,CostoParametrico!$D$3:$D$18,0),8)","v":300},0,0,0,0,0,0,0,1,0,0,0,0,0,0,0,0,0,0,0,0,0,0,0,0,0,1.1000000000000001]
[1,1,95,1,"N","A - Abitativo",0,0,"Privata",10,"N",0,0,0,0,"N","N","L0",0,0,0,0,0,0,"Abitativa-L0",0,{"$f":"MAX(0,(V236)-INDEX(CostoParametrico!$E$3:$L$18,MATCH($Y236,CostoParametrico!$D$3:$D$18,0),1)-AB236-AC236)*IF(AND($D$20=\"A\",MID($F236,1,1)<>\"A\"),0%,100%)","v":0},{"$f":"MAX(0,(V236)-INDEX(CostoParametrico!$E$3:$L$18,MATCH($Y236,CostoParametrico!$D$3:$D$18,0),2)-AC236)*IF(AND($D$20=\"A\",MID($F236,1,1)<>\"A\"),0%,100%)","v":0},{"$f":"MAX(0,(V236)-INDEX(CostoParametrico!$E$3:$L$18,MATCH($Y236,CostoParametrico!$D$3:$D$18,0),3))*IF(AND($D$20=\"A\",MID($F236,1,1)<>\"A\"),0%,100%)","v":0},0,{"$f":"MAX(0,(V236+W236)-INDEX(CostoParametrico!$E$3:$L$18,MATCH($Y236,CostoParametrico!$D$3:$D$18,0),1)-AA236-AB236-AC236-AF236-AG236)*IF(AND($D$20=\"A\",MID($F236,1,1)<>\"A\"),0%,100%)","v":0},{"$f":"MAX(0,(V236+W236)-INDEX(CostoParametrico!$E$3:$L$18,MATCH($Y236,CostoParametrico!$D$3:$D$18,0),2)-AB236-AC236-AG236)*IF(AND($D$20=\"A\",MID(F236,1,1)<>\"A\"),0%,100%)","v":0},{"$f":"MAX(0,(V236+W236)-INDEX(CostoParametrico!$E$3:$L$18,MATCH($Y236,CostoParametrico!$D$3:$D$18,0),3)-AC236)*IF(AND($D$20=\"A\",MID(F236,1,1)<>\"A\"),0%,100%)","v":0},{"$f":"INDEX(CostoParametrico!$E$3:$L$18,MATCH($Y236,CostoParametrico!$D$3:$D$18,0),5)","v":400},{"$f":"INDEX(CostoParametrico!$E$3:$L$18,MATCH($Y236,CostoParametrico!$D$3:$D$18,0),6)","v":330},{"$f":"INDEX(CostoParametrico!$E$3:$L$18,MATCH($Y236,CostoParametrico!$D$3:$D$18,0),7)","v":300},{"$f":"INDEX(CostoParametrico!$E$3:$L$18,MATCH($Y236,CostoParametrico!$D$3:$D$18,0),8)","v":300},0,0,0,0,0,0,0,1,0,0,0,0,0,0,0,0,0,0,0,0,0,0,0,0,0,1.1000000000000001]
[1,1,96,1,"N","A - Abitativo",0,0,"Privata",10,"N",0,0,0,0,"N","N","L0",0,0,0,0,0,0,"Abitativa-L0",0,{"$f":"MAX(0,(V237)-INDEX(CostoParametrico!$E$3:$L$18,MATCH($Y237,CostoParametrico!$D$3:$D$18,0),1)-AB237-AC237)*IF(AND($D$20=\"A\",MID($F237,1,1)<>\"A\"),0%,100%)","v":0},{"$f":"MAX(0,(V237)-INDEX(CostoParametrico!$E$3:$L$18,MATCH($Y237,CostoParametrico!$D$3:$D$18,0),2)-AC237)*IF(AND($D$20=\"A\",MID($F237,1,1)<>\"A\"),0%,100%)","v":0},{"$f":"MAX(0,(V237)-INDEX(CostoParametrico!$E$3:$L$18,MATCH($Y237,CostoParametrico!$D$3:$D$18,0),3))*IF(AND($D$20=\"A\",MID($F237,1,1)<>\"A\"),0%,100%)","v":0},0,{"$f":"MAX(0,(V237+W237)-INDEX(CostoParametrico!$E$3:$L$18,MATCH($Y237,CostoParametrico!$D$3:$D$18,0),1)-AA237-AB237-AC237-AF237-AG237)*IF(AND($D$20=\"A\",MID($F237,1,1)<>\"A\"),0%,100%)","v":0},{"$f":"MAX(0,(V237+W237)-INDEX(CostoParametrico!$E$3:$L$18,MATCH($Y237,CostoParametrico!$D$3:$D$18,0),2)-AB237-AC237-AG237)*IF(AND($D$20=\"A\",MID(F237,1,1)<>\"A\"),0%,100%)","v":0},{"$f":"MAX(0,(V237+W237)-INDEX(CostoParametrico!$E$3:$L$18,MATCH($Y237,CostoParametrico!$D$3:$D$18,0),3)-AC237)*IF(AND($D$20=\"A\",MID(F237,1,1)<>\"A\"),0%,100%)","v":0},{"$f":"INDEX(CostoParametrico!$E$3:$L$18,MATCH($Y237,CostoParametrico!$D$3:$D$18,0),5)","v":400},{"$f":"INDEX(CostoParametrico!$E$3:$L$18,MATCH($Y237,CostoParametrico!$D$3:$D$18,0),6)","v":330},{"$f":"INDEX(CostoParametrico!$E$3:$L$18,MATCH($Y237,CostoParametrico!$D$3:$D$18,0),7)","v":300},{"$f":"INDEX(CostoParametrico!$E$3:$L$18,MATCH($Y237,CostoParametrico!$D$3:$D$18,0),8)","v":300},0,0,0,0,0,0,0,1,0,0,0,0,0,0,0,0,0,0,0,0,0,0,0,0,0,1.1000000000000001]
[1,1,97,1,"N","A - Abitativo",0,0,"Privata",10,"N",0,0,0,0,"N","N","L0",0,0,0,0,0,0,"Abitativa-L0",0,{"$f":"MAX(0,(V238)-INDEX(CostoParametrico!$E$3:$L$18,MATCH($Y238,CostoParametrico!$D$3:$D$18,0),1)-AB238-AC238)*IF(AND($D$20=\"A\",MID($F238,1,1)<>\"A\"),0%,100%)","v":0},{"$f":"MAX(0,(V238)-INDEX(CostoParametrico!$E$3:$L$18,MATCH($Y238,CostoParametrico!$D$3:$D$18,0),2)-AC238)*IF(AND($D$20=\"A\",MID($F238,1,1)<>\"A\"),0%,100%)","v":0},{"$f":"MAX(0,(V238)-INDEX(CostoParametrico!$E$3:$L$18,MATCH($Y238,CostoParametrico!$D$3:$D$18,0),3))*IF(AND($D$20=\"A\",MID($F238,1,1)<>\"A\"),0%,100%)","v":0},0,{"$f":"MAX(0,(V238+W238)-INDEX(CostoParametrico!$E$3:$L$18,MATCH($Y238,CostoParametrico!$D$3:$D$18,0),1)-AA238-AB238-AC238-AF238-AG238)*IF(AND($D$20=\"A\",MID($F238,1,1)<>\"A\"),0%,100%)","v":0},{"$f":"MAX(0,(V238+W238)-INDEX(CostoParametrico!$E$3:$L$18,MATCH($Y238,CostoParametrico!$D$3:$D$18,0),2)-AB238-AC238-AG238)*IF(AND($D$20=\"A\",MID(F238,1,1)<>\"A\"),0%,100%)","v":0},{"$f":"MAX(0,(V238+W238)-INDEX(CostoParametrico!$E$3:$L$18,MATCH($Y238,CostoParametrico!$D$3:$D$18,0),3)-AC238)*IF(AND($D$20=\"A\",MID(F238,1,1)<>\"A\"),0%,100%)","v":0},{"$f":"INDEX(CostoParametrico!$E$3:$L$18,MATCH($Y238,CostoParametrico!$D$3:$D$18,0),5)","v":400},{"$f":"INDEX(CostoParametrico!$E$3:$L$18,MATCH($Y238,CostoParametrico!$D$3:$D$18,0),6)","v":330},{"$f":"INDEX(CostoParametrico!$E$3:$L$18,MATCH($Y238,CostoParametrico!$D$3:$D$18,0),7)","v":300},{"$f":"INDEX(CostoParametrico!$E$3:$L$18,MATCH($Y238,CostoParametrico!$D$3:$D$18,0),8)","v":300},0,0,0,0,0,0,0,1,0,0,0,0,0,0,0,0,0,0,0,0,0,0,0,0,0,1.1000000000000001]
[1,1,98,1,"N","A - Abitativo",0,0,"Privata",10,"N",0,0,0,0,"N","N","L0",0,0,0,0,0,0,"Abitativa-L0",0,{"$f":"MAX(0,(V239)-INDEX(CostoParametrico!$E$3:$L$18,MATCH($Y239,CostoParametrico!$D$3:$D$18,0),1)-AB239-AC239)*IF(AND($D$20=\"A\",MID($F239,1,1)<>\"A\"),0%,100%)","v":0},{"$f":"MAX(0,(V239)-INDEX(CostoParametrico!$E$3:$L$18,MATCH($Y239,CostoParametrico!$D$3:$D$18,0),2)-AC239)*IF(AND($D$20=\"A\",MID($F239,1,1)<>\"A\"),0%,100%)","v":0},{"$f":"MAX(0,(V239)-INDEX(CostoParametrico!$E$3:$L$18,MATCH($Y239,CostoParametrico!$D$3:$D$18,0),3))*IF(AND($D$20=\"A\",MID($F239,1,1)<>\"A\"),0%,100%)","v":0},0,{"$f":"MAX(0,(V239+W239)-INDEX(CostoParametrico!$E$3:$L$18,MATCH($Y239,CostoParametrico!$D$3:$D$18,0),1)-AA239-AB239-AC239-AF239-AG239)*IF(AND($D$20=\"A\",MID($F239,1,1)<>\"A\"),0%,100%)","v":0},{"$f":"MAX(0,(V239+W239)-INDEX(CostoParametrico!$E$3:$L$18,MATCH($Y239,CostoParametrico!$D$3:$D$18,0),2)-AB239-AC239-AG239)*IF(AND($D$20=\"A\",MID(F239,1,1)<>\"A\"),0%,100%)","v":0},{"$f":"MAX(0,(V239+W239)-INDEX(CostoParametrico!$E$3:$L$18,MATCH($Y239,CostoParametrico!$D$3:$D$18,0),3)-AC239)*IF(AND($D$20=\"A\",MID(F239,1,1)<>\"A\"),0%,100%)","v":0},{"$f":"INDEX(CostoParametrico!$E$3:$L$18,MATCH($Y239,CostoParametrico!$D$3:$D$18,0),5)","v":400},{"$f":"INDEX(CostoParametrico!$E$3:$L$18,MATCH($Y239,CostoParametrico!$D$3:$D$18,0),6)","v":330},{"$f":"INDEX(CostoParametrico!$E$3:$L$18,MATCH($Y239,CostoParametrico!$D$3:$D$18,0),7)","v":300},{"$f":"INDEX(CostoParametrico!$E$3:$L$18,MATCH($Y239,CostoParametrico!$D$3:$D$18,0),8)","v":300},0,0,0,0,0,0,0,1,0,0,0,0,0,0,0,0,0,0,0,0,0,0,0,0,0,1.1000000000000001]
[1,1,99,1,"N","A - Abitativo",0,0,"Privata",10,"N",0,0,0,0,"N","N","L0",0,0,0,0,0,0,"Abitativa-L0",0,{"$f":"MAX(0,(V240)-INDEX(CostoParametrico!$E$3:$L$18,MATCH($Y240,CostoParametrico!$D$3:$D$18,0),1)-AB240-AC240)*IF(AND($D$20=\"A\",MID($F240,1,1)<>\"A\"),0%,100%)","v":0},{"$f":"MAX(0,(V240)-INDEX(CostoParametrico!$E$3:$L$18,MATCH($Y240,CostoParametrico!$D$3:$D$18,0),2)-AC240)*IF(AND($D$20=\"A\",MID($F240,1,1)<>\"A\"),0%,100%)","v":0},{"$f":"MAX(0,(V240)-INDEX(CostoParametrico!$E$3:$L$18,MATCH($Y240,CostoParametrico!$D$3:$D$18,0),3))*IF(AND($D$20=\"A\",MID($F240,1,1)<>\"A\"),0%,100%)","v":0},0,{"$f":"MAX(0,(V240+W240)-INDEX(CostoParametrico!$E$3:$L$18,MATCH($Y240,CostoParametrico!$D$3:$D$18,0),1)-AA240-AB240-AC240-AF240-AG240)*IF(AND($D$20=\"A\",MID($F240,1,1)<>\"A\"),0%,100%)","v":0},{"$f":"MAX(0,(V240+W240)-INDEX(CostoParametrico!$E$3:$L$18,MATCH($Y240,CostoParametrico!$D$3:$D$18,0),2)-AB240-AC240-AG240)*IF(AND($D$20=\"A\",MID(F240,1,1)<>\"A\"),0%,100%)","v":0},{"$f":"MAX(0,(V240+W240)-INDEX(CostoParametrico!$E$3:$L$18,MATCH($Y240,CostoParametrico!$D$3:$D$18,0),3)-AC240)*IF(AND($D$20=\"A\",MID(F240,1,1)<>\"A\"),0%,100%)","v":0},{"$f":"INDEX(CostoParametrico!$E$3:$L$18,MATCH($Y240,CostoParametrico!$D$3:$D$18,0),5)","v":400},{"$f":"INDEX(CostoParametrico!$E$3:$L$18,MATCH($Y240,CostoParametrico!$D$3:$D$18,0),6)","v":330},{"$f":"INDEX(CostoParametrico!$E$3:$L$18,MATCH($Y240,CostoParametrico!$D$3:$D$18,0),7)","v":300},{"$f":"INDEX(CostoParametrico!$E$3:$L$18,MATCH($Y240,CostoParametrico!$D$3:$D$18,0),8)","v":300},0,0,0,0,0,0,0,1,0,0,0,0,0,0,0,0,0,0,0,0,0,0,0,0,0,1.1000000000000001]
[1,1,100,1,"N","A - Abitativo",0,0,"Privata",10,"N",0,0,0,0,"N","N","L0",0,0,0,0,0,0,"Abitativa-L0",0,{"$f":"MAX(0,(V241)-INDEX(CostoParametrico!$E$3:$L$18,MATCH($Y241,CostoParametrico!$D$3:$D$18,0),1)-AB241-AC241)*IF(AND($D$20=\"A\",MID($F241,1,1)<>\"A\"),0%,100%)","v":0},{"$f":"MAX(0,(V241)-INDEX(CostoParametrico!$E$3:$L$18,MATCH($Y241,CostoParametrico!$D$3:$D$18,0),2)-AC241)*IF(AND($D$20=\"A\",MID($F241,1,1)<>\"A\"),0%,100%)","v":0},{"$f":"MAX(0,(V241)-INDEX(CostoParametrico!$E$3:$L$18,MATCH($Y241,CostoParametrico!$D$3:$D$18,0),3))*IF(AND($D$20=\"A\",MID($F241,1,1)<>\"A\"),0%,100%)","v":0},0,{"$f":"MAX(0,(V241+W241)-INDEX(CostoParametrico!$E$3:$L$18,MATCH($Y241,CostoParametrico!$D$3:$D$18,0),1)-AA241-AB241-AC241-AF241-AG241)*IF(AND($D$20=\"A\",MID($F241,1,1)<>\"A\"),0%,100%)","v":0},{"$f":"MAX(0,(V241+W241)-INDEX(CostoParametrico!$E$3:$L$18,MATCH($Y241,CostoParametrico!$D$3:$D$18,0),2)-AB241-AC241-AG241)*IF(AND($D$20=\"A\",MID(F241,1,1)<>\"A\"),0%,100%)","v":0},{"$f":"MAX(0,(V241+W241)-INDEX(CostoParametrico!$E$3:$L$18,MATCH($Y241,CostoParametrico!$D$3:$D$18,0),3)-AC241)*IF(AND($D$20=\"A\",MID(F241,1,1)<>\"A\"),0%,100%)","v":0},{"$f":"INDEX(CostoParametrico!$E$3:$L$18,MATCH($Y241,CostoParametrico!$D$3:$D$18,0),5)","v":400},{"$f":"INDEX(CostoParametrico!$E$3:$L$18,MATCH($Y241,CostoParametrico!$D$3:$D$18,0),6)","v":330},{"$f":"INDEX(CostoParametrico!$E$3:$L$18,MATCH($Y241,CostoParametrico!$D$3:$D$18,0),7)","v":300},{"$f":"INDEX(CostoParametrico!$E$3:$L$18,MATCH($Y241,CostoParametrico!$D$3:$D$18,0),8)","v":300},0,0,0,0,0,0,0,1,0,0,0,0,0,0,0,0,0,0,0,0,0,0,0,0,0,1.1000000000000001]

{"sheet":"CONTRIBUTO","index":1,"n_rows":280,"n_cols":25,"rows_kept":280,"cut":false,"hidden":false,"merged":[[24,1,24,8],[131,1,131,8],[176,1,176,6]]}
[{"$f":"RICHIESTA!E18","v":"N"}]
[]
[]
[]
[]
[]
[]
[]
[]
[]
[]
[]
[]
[]
[]
[]
[]
[]
[]
[]
[]
[]
[]
[]
[null,"TABELLA A"]
[null,"ALLOCAZIONE DEL CONTRIBUTO PER BENEFICIARIO",null,null,null,null,null,null,null,null,null,null,null,null,"REALE",null,null,null,null,"ARROTONDATO"]
[null,"UNITA IMMOBILIARE",null,"UI%","US%","COSTO INTERVENTO","ASSICURAZIONE","ACCOLLO","CONTRIBUTO","TIPO",null,null,null,null,"COSTO","ASSICURAZIONE","ACCOLLO","CONTRIBUTO",null,"COSTO","ASSICURAZIONE","ACCOLLO","CONTRIBUTO"]
["PC","PARTI COMUNI",null,1,1,{"$f":"T28","v":0},0,0,{"$f":"W28+IF($A1=\"N\",0,I172-W129)","v":0},null,null,null,null,null,{"$f":"IF($A1=\"N\",0,RICHIESTA!$O$128-RICHIESTA!$O$109)","v":0},{"$f":"IF($A1=\"N\",0,RICHIESTA!AZ$140)","v":0},{"$f":"O28-R28-P28","v":0},{"$f":"IF($A1=\"N\",0,RICHIESTA!$AB$128-RICHIESTA!$AB$109)","v":0},null,{"$f":"ROUND(O28,2)","v":0},{"$f":"ROUND(P28,2)","v":0},{"$f":"T28-W28-U28","v":0},{"$f":"ROUND(R28,2)","v":0}]
[{"$f":"RICHIESTA!C142","v":1},{"$f":"\"UNITA IMMOBILIARE \"&A29","v":"UNITA IMMOBILIARE 1"},null,1,{"$f":"INDEX(RICHIESTA!$X$142:$X$241,MATCH(A29,RICHIESTA!$C$142:$C$241,0))","v":1E-13},0,0,0,{"$f":"W29","v":0},{"$f":"INDEX(RICHIESTA!$I$142:$I$241,MATCH(A29,RICHIESTA!$C$142:$C$241,0))","v":"Privata"},null,null,null,null,{"$f":"$D29*(INDEX(RICHIESTA!$BG$142:$BG$241,MATCH($A29,RICHIESTA!$C$142:$C$241,0))\n+$E29*IF($A$1=\"N\",RICHIESTA!$O$128-RICHIESTA!$O$109,0))","v":1.1000000000000001E-23},{"$f":"$D29*(INDEX(RICHIESTA!$BA$142:$BA$241,MATCH($A29,RICHIESTA!$C$142:$C$241,0))\n+IF($A$1=\"N\",INDEX(RICHIESTA!$AU$142:$AU$241,MATCH($A29,RICHIESTA!$C$142:$C$241,0))/MAX(RICHIESTA!$AU$140,10^-9)*(RICHIESTA!$AC$128-RICHIESTA!$AC$109),0))","v":0},{"$f":"O29-R29-P29","v":0},{"$f":"$D29*(INDEX(RICHIESTA!$BC$142:$BC$241,MATCH($A29,RICHIESTA!$C$142:$C$241,0))\n+IF($A$1=\"N\",INDEX(RICHIESTA!$BB$142:$BB$241,MATCH($A29,RICHIESTA!$C$142:$C$241,0)),0))","v":1.1000000000000001E-23},null,{"$f":"ROUND(O29,2)","v":0},{"$f":"ROUND(P29,2)","v":0},{"$f":"T29-W29-U29","v":0},{"$f":"ROUND(R29,2)","v":0}]
[{"$f":"RICHIESTA!C143","v":2},{"$f":"\"UNITA IMMOBILIARE \"&A30","v":"UNITA IMMOBILIARE 2"},null,1,{"$f":"INDEX(RICHIESTA!$X$142:$X$241,MATCH(A30,RICHIESTA!$C$142:$C$241,0))","v":0},{"$f":"T30","v":0},{"$f":"U30","v":0},{"$f":"V30","v":0},{"$f":"W30","v":0},{"$f":"INDEX(RICHIESTA!$I$142:$I$241,MATCH(A30,RICHIESTA!$C$142:$C$241,0))","v":"Privata"},null,null,null,null,{"$f":"$D30*(INDEX(RICHIESTA!$BG$142:$BG$241,MATCH($A30,RICHIESTA!$C$142:$C$241,0))\n+$E30*IF($A$1=\"N\",RICHIESTA!$O$128-RICHIESTA!$O$109,0))","v":0},{"$f":"$D30*(INDEX(RICHIESTA!$BA$142:$BA$241,MATCH($A30,RICHIESTA!$C$142:$C$241,0))\n+IF($A$1=\"N\",INDEX(RICHIESTA!$AU$142:$AU$241,MATCH($A30,RICHIESTA!$C$142:$C$241,0))/MAX(RICHIESTA!$AU$140,10^-9)*(RICHIESTA!$AC$128-RICHIESTA!$AC$109),0))","v":0},{"$f":"O30-R30-P30","v":0},{"$f":"$D30*(INDEX(RICHIESTA!$BC$142:$BC$241,MATCH($A30,RICHIESTA!$C$142:$C$241,0))\n+IF($A$1=\"N\",INDEX(RICHIESTA!$BB$142:$BB$241,MATCH($A30,RICHIESTA!$C$142:$C$241,0)),0))","v":0},null,{"$f":"ROUND(O30,2)","v":0},{"$f":"ROUND(P30,2)","v":0},{"$f":"T30-W30-U30","v":0},{"$f":"ROUND(R30,2)","v":0}]
[{"$f":"RICHIESTA!C144","v":3},"UNITA IMMOBILIARE 3",null,1,{"$f":"INDEX(RICHIESTA!$X$142:$X$241,MATCH(A31,RICHIESTA!$C$142:$C$241,0))","v":0},0,0,0,0,{"$f":"INDEX(RICHIESTA!$I$142:$I$241,MATCH(A31,RICHIESTA!$C$142:$C$241,0))","v":"Privata"},null,null,null,null,{"$f":"$D31*(INDEX(RICHIESTA!$BG$142:$BG$241,MATCH($A31,RICHIESTA!$C$142:$C$241,0))\n+$E31*IF($A$1=\"N\",RICHIESTA!$O$128-RICHIESTA!$O$109,0))","v":0},{"$f":"$D31*(INDEX(RICHIESTA!$BA$142:$BA$241,MATCH($A31,RICHIESTA!$C$142:$C$241,0))\n+IF($A$1=\"N\",INDEX(RICHIESTA!$AU$142:$AU$241,MATCH($A31,RICHIESTA!$C$142:$C$241,0))/MAX(RICHIESTA!$AU$140,10^-9)*(RICHIESTA!$AC$128-RICHIESTA!$AC$109),0))","v":0},0,{"$f":"$D31*(INDEX(RICHIESTA!$BC$142:$BC$241,MATCH($A31,RICHIESTA!$C$142:$C$241,0))\n+IF($A$1=\"N\",INDEX(RICHIESTA!$BB$142:$BB$241,MATCH($A31,RICHIESTA!$C$142:$C$241,0)),0))","v":0},null,0,0,0,0]
[{"$f":"RICHIESTA!C145","v":4},"UNITA IMMOBILIARE 4",null,1,{"$f":"INDEX(RICHIESTA!$X$142:$X$241,MATCH(A32,RICHIESTA!$C$142:$C$241,0))","v":0},0,0,0,0,{"$f":"INDEX(RICHIESTA!$I$142:$I$241,MATCH(A32,RICHIESTA!$C$142:$C$241,0))","v":"Privata"},null,null,null,null,{"$f":"$D32*(INDEX(RICHIESTA!$BG$142:$BG$241,MATCH($A32,RICHIESTA!$C$142:$C$241,0))\n+$E32*IF($A$1=\"N\",RICHIESTA!$O$128-RICHIESTA!$O$109,0))","v":0},{"$f":"$D32*(INDEX(RICHIESTA!$BA$142:$BA$241,MATCH($A32,RICHIESTA!$C$142:$C$241,0))\n+IF($A$1=\"N\",INDEX(RICHIESTA!$AU$142:$AU$241,MATCH($A32,RICHIESTA!$C$142:$C$241,0))/MAX(RICHIESTA!$AU$140,10^-9)*(RICHIESTA!$AC$128-RICHIESTA!$AC$109),0))","v":0},0,{"$f":"$D32*(INDEX(RICHIESTA!$BC$142:$BC$241,MATCH($A32,RICHIESTA!$C$142:$C$241,0))\n+IF($A$1=\"N\",INDEX(RICHIESTA!$BB$142:$BB$241,MATCH($A32,RICHIESTA!$C$142:$C$241,0)),0))","v":0},null,0,0,0,0]
[{"$f":"RICHIESTA!C146","v":5},"UNITA IMMOBILIARE 5",null,1,{"$f":"INDEX(RICHIESTA!$X$142:$X$241,MATCH(A33,RICHIESTA!$C$142:$C$241,0))","v":0},0,0,0,0,{"$f":"INDEX(RICHIESTA!$I$142:$I$241,MATCH(A33,RICHIESTA!$C$142:$C$241,0))","v":"Privata"},null,null,null,null,{"$f":"$D33*(INDEX(RICHIESTA!$BG$142:$BG$241,MATCH($A33,RICHIESTA!$C$142:$C$241,0))\n+$E33*IF($A$1=\"N\",RICHIESTA!$O$128-RICHIESTA!$O$109,0))","v":0},{"$f":"$D33*(INDEX(RICHIESTA!$BA$142:$BA$241,MATCH($A33,RICHIESTA!$C$142:$C$241,0))\n+IF($A$1=\"N\",INDEX(RICHIESTA!$AU$142:$AU$241,MATCH($A33,RICHIESTA!$C$142:$C$241,0))/MAX(RICHIESTA!$AU$140,10^-9)*(RICHIESTA!$AC$128-RICHIESTA!$AC$109),0))","v":0},0,{"$f":"$D33*(INDEX(RICHIESTA!$BC$142:$BC$241,MATCH($A33,RICHIESTA!$C$142:$C$241,0))\n+IF($A$1=\"N\",INDEX(RICHIESTA!$BB$142:$BB$241,MATCH($A33,RICHIESTA!$C$142:$C$241,0)),0))","v":0},null,0,0,0,0]
[{"$f":"RICHIESTA!C147","v":6},"UNITA IMMOBILIARE 6",null,1,{"$f":"INDEX(RICHIESTA!$X$142:$X$241,MATCH(A34,RICHIESTA!$C$142:$C$241,0))","v":0},0,0,0,0,{"$f":"INDEX(RICHIESTA!$I$142:$I$241,MATCH(A34,RICHIESTA!$C$142:$C$241,0))","v":"Privata"},null,null,null,null,{"$f":"$D34*(INDEX(RICHIESTA!$BG$142:$BG$241,MATCH($A34,RICHIESTA!$C$142:$C$241,0))\n+$E34*IF($A$1=\"N\",RICHIESTA!$O$128-RICHIESTA!$O$109,0))","v":0},{"$f":"$D34*(INDEX(RICHIESTA!$BA$142:$BA$241,MATCH($A34,RICHIESTA!$C$142:$C$241,0))\n+IF($A$1=\"N\",INDEX(RICHIESTA!$AU$142:$AU$241,MATCH($A34,RICHIESTA!$C$142:$C$241,0))/MAX(RICHIESTA!$AU$140,10^-9)*(RICHIESTA!$AC$128-RICHIESTA!$AC$109),0))","v":0},0,{"$f":"$D34*(INDEX(RICHIESTA!$BC$142:$BC$241,MATCH($A34,RICHIESTA!$C$142:$C$241,0))\n+IF($A$1=\"N\",INDEX(RICHIESTA!$BB$142:$BB$241,MATCH($A34,RICHIESTA!$C$142:$C$241,0)),0))","v":0},null,0,0,0,0]
[{"$f":"RICHIESTA!C148","v":7},"UNITA IMMOBILIARE 7",null,1,{"$f":"INDEX(RICHIESTA!$X$142:$X$241,MATCH(A35,RICHIESTA!$C$142:$C$241,0))","v":0},0,0,0,0,{"$f":"INDEX(RICHIESTA!$I$142:$I$241,MATCH(A35,RICHIESTA!$C$142:$C$241,0))","v":"Privata"},null,null,null,null,{"$f":"$D35*(INDEX(RICHIESTA!$BG$142:$BG$241,MATCH($A35,RICHIESTA!$C$142:$C$241,0))\n+$E35*IF($A$1=\"N\",RICHIESTA!$O$128-RICHIESTA!$O$109,0))","v":0},{"$f":"$D35*(INDEX(RICHIESTA!$BA$142:$BA$241,MATCH($A35,RICHIESTA!$C$142:$C$241,0))\n+IF($A$1=\"N\",INDEX(RICHIESTA!$AU$142:$AU$241,MATCH($A35,RICHIESTA!$C$142:$C$241,0))/MAX(RICHIESTA!$AU$140,10^-9)*(RICHIESTA!$AC$128-RICHIESTA!$AC$109),0))","v":0},0,{"$f":"$D35*(INDEX(RICHIESTA!$BC$142:$BC$241,MATCH($A35,RICHIESTA!$C$142:$C$241,0))\n+IF($A$1=\"N\",INDEX(RICHIESTA!$BB$142:$BB$241,MATCH($A35,RICHIESTA!$C$142:$C$241,0)),0))","v":0},null,0,0,0,0]
[{"$f":"RICHIESTA!C149","v":8},"UNITA IMMOBILIARE 8",null,1,{"$f":"INDEX(RICHIESTA!$X$142:$X$241,MATCH(A36,RICHIESTA!$C$142:$C$241,0))","v":0},0,0,0,0,{"$f":"INDEX(RICHIESTA!$I$142:$I$241,MATCH(A36,RICHIESTA!$C$142:$C$241,0))","v":"Privata"},null,null,null,null,{"$f":"$D36*(INDEX(RICHIESTA!$BG$142:$BG$241,MATCH($A36,RICHIESTA!$C$142:$C$241,0))\n+$E36*IF($A$1=\"N\",RICHIESTA!$O$128-RICHIESTA!$O$109,0))","v":0},{"$f":"$D36*(INDEX(RICHIESTA!$BA$142:$BA$241,MATCH($A36,RICHIESTA!$C$142:$C$241,0))\n+IF($A$1=\"N\",INDEX(RICHIESTA!$AU$142:$AU$241,MATCH($A36,RICHIESTA!$C$142:$C$241,0))/MAX(RICHIESTA!$AU$140,10^-9)*(RICHIESTA!$AC$128-RICHIESTA!$AC$109),0))","v":0},0,{"$f":"$D36*(INDEX(RICHIESTA!$BC$142:$BC$241,MATCH($A36,RICHIESTA!$C$142:$C$241,0))\n+IF($A$1=\"N\",INDEX(RICHIESTA!$BB$142:$BB$241,MATCH($A36,RICHIESTA!$C$142:$C$241,0)),0))","v":0},null,0,0,0,0]
[{"$f":"RICHIESTA!C150","v":9},"UNITA IMMOBILIARE 9",null,1,{"$f":"INDEX(RICHIESTA!$X$142:$X$241,MATCH(A37,RICHIESTA!$C$142:$C$241,0))","v":0},0,0,0,0,{"$f":"INDEX(RICHIESTA!$I$142:$I$241,MATCH(A37,RICHIESTA!$C$142:$C$241,0))","v":"Privata"},null,null,null,null,{"$f":"$D37*(INDEX(RICHIESTA!$BG$142:$BG$241,MATCH($A37,RICHIESTA!$C$142:$C$241,0))\n+$E37*IF($A$1=\"N\",RICHIESTA!$O$128-RICHIESTA!$O$109,0))","v":0},{"$f":"$D37*(INDEX(RICHIESTA!$BA$142:$BA$241,MATCH($A37,RICHIESTA!$C$142:$C$241,0))\n+IF($A$1=\"N\",INDEX(RICHIESTA!$AU$142:$AU$241,MATCH($A37,RICHIESTA!$C$142:$C$241,0))/MAX(RICHIESTA!$AU$140,10^-9)*(RICHIESTA!$AC$128-RICHIESTA!$AC$109),0))","v":0},0,{"$f":"$D37*(INDEX(RICHIESTA!$BC$142:$BC$241,MATCH($A37,RICHIESTA!$C$142:$C$241,0))\n+IF($A$1=\"N\",INDEX(RICHIESTA!$BB$142:$BB$241,MATCH($A37,RICHIESTA!$C$142:$C$241,0)),0))","v":0},null,0,0,0,0]
[{"$f":"RICHIESTA!C151","v":10},"UNITA IMMOBILIARE 10",null,1,{"$f":"INDEX(RICHIESTA!$X$142:$X$241,MATCH(A38,RICHIESTA!$C$142:$C$241,0))","v":0},0,0,0,0,{"$f":"INDEX(RICHIESTA!$I$142:$I$241,MATCH(A38,RICHIESTA!$C$142:$C$241,0))","v":"Privata"},null,null,null,null,{"$f":"$D38*(INDEX(RICHIESTA!$BG$142:$BG$241,MATCH($A38,RICHIESTA!$C$142:$C$241,0))\n+$E38*IF($A$1=\"N\",RICHIESTA!$O$128-RICHIESTA!$O$109,0))","v":0},{"$f":"$D38*(INDEX(RICHIESTA!$BA$142:$BA$241,MATCH($A38,RICHIESTA!$C$142:$C$241,0))\n+IF($A$1=\"N\",INDEX(RICHIESTA!$AU$142:$AU$241,MATCH($A38,RICHIESTA!$C$142:$C$241,0))/MAX(RICHIESTA!$AU$140,10^-9)*(RICHIESTA!$AC$128-RICHIESTA!$AC$109),0))","v":0},0,{"$f":"$D38*(INDEX(RICHIESTA!$BC$142:$BC$241,MATCH($A38,RICHIESTA!$C$142:$C$241,0))\n+IF($A$1=\"N\",INDEX(RICHIESTA!$BB$142:$BB$241,MATCH($A38,RICHIESTA!$C$142:$C$241,0)),0))","v":0},null,0,0,0,0]
[{"$f":"RICHIESTA!C152","v":11},"UNITA IMMOBILIARE 11",null,1,{"$f":"INDEX(RICHIESTA!$X$142:$X$241,MATCH(A39,RICHIESTA!$C$142:$C$241,0))","v":0},0,0,0,0,{"$f":"INDEX(RICHIESTA!$I$142:$I$241,MATCH(A39,RICHIESTA!$C$142:$C$241,0))","v":"Privata"},null,null,null,null,{"$f":"$D39*(INDEX(RICHIESTA!$BG$142:$BG$241,MATCH($A39,RICHIESTA!$C$142:$C$241,0))\n+$E39*IF($A$1=\"N\",RICHIESTA!$O$128-RICHIESTA!$O$109,0))","v":0},{"$f":"$D39*(INDEX(RICHIESTA!$BA$142:$BA$241,MATCH($A39,RICHIESTA!$C$142:$C$241,0))\n+IF($A$1=\"N\",INDEX(RICHIESTA!$AU$142:$AU$241,MATCH($A39,RICHIESTA!$C$142:$C$241,0))/MAX(RICHIESTA!$AU$140,10^-9)*(RICHIESTA!$AC$128-RICHIESTA!$AC$109),0))","v":0},0,{"$f":"$D39*(INDEX(RICHIESTA!$BC$142:$BC$241,MATCH($A39,RICHIESTA!$C$142:$C$241,0))\n+IF($A$1=\"N\",INDEX(RICHIESTA!$BB$142:$BB$241,MATCH($A39,RICHIESTA!$C$142:$C$241,0)),0))","v":0},null,0,0,0,0]
[{"$f":"RICHIESTA!C153","v":12},"UNITA IMMOBILIARE 12",null,1,{"$f":"INDEX(RICHIESTA!$X$142:$X$241,MATCH(A40,RICHIESTA!$C$142:$C$241,0))","v":0},0,0,0,0,{"$f":"INDEX(RICHIESTA!$I$142:$I$241,MATCH(A40,RICHIESTA!$C$142:$C$241,0))","v":"Privata"},null,null,null,null,{"$f":"$D40*(INDEX(RICHIESTA!$BG$142:$BG$241,MATCH($A40,RICHIESTA!$C$142:$C$241,0))\n+$E40*IF($A$1=\"N\",RICHIESTA!$O$128-RICHIESTA!$O$109,0))","v":0},{"$f":"$D40*(INDEX(RICHIESTA!$BA$142:$BA$241,MATCH($A40,RICHIESTA!$C$142:$C$241,0))\n+IF($A$1=\"N\",INDEX(RICHIESTA!$AU$142:$AU$241,MATCH($A40,RICHIESTA!$C$142:$C$241,0))/MAX(RICHIESTA!$AU$140,10^-9)*(RICHIESTA!$AC$128-RICHIESTA!$AC$109),0))","v":0},0,{"$f":"$D40*(INDEX(RICHIESTA!$BC$142:$BC$241,MATCH($A40,RICHIESTA!$C$142:$C$241,0))\n+IF($A$1=\"N\",INDEX(RICHIESTA!$BB$142:$BB$241,MATCH($A40,RICHIESTA!$C$142:$C$241,0)),0))","v":0},null,0,0,0,0]
[{"$f":"RICHIESTA!C154","v":13},"UNITA IMMOBILIARE 13",null,1,{"$f":"INDEX(RICHIESTA!$X$142:$X$241,MATCH(A41,RICHIESTA!$C$142:$C$241,0))","v":0},0,0,0,0,{"$f":"INDEX(RICHIESTA!$I$142:$I$241,MATCH(A41,RICHIESTA!$C$142:$C$241,0))","v":"Privata"},null,null,null,null,{"$f":"$D41*(INDEX(RICHIESTA!$BG$142:$BG$241,MATCH($A41,RICHIESTA!$C$142:$C$241,0))\n+$E41*IF($A$1=\"N\",RICHIESTA!$O$128-RICHIESTA!$O$109,0))","v":0},{"$f":"$D41*(INDEX(RICHIESTA!$BA$142:$BA$241,MATCH($A41,RICHIESTA!$C$142:$C$241,0))\n+IF($A$1=\"N\",INDEX(RICHIESTA!$AU$142:$AU$241,MATCH($A41,RICHIESTA!$C$142:$C$241,0))/MAX(RICHIESTA!$AU$140,10^-9)*(RICHIESTA!$AC$128-RICHIESTA!$AC$109),0))","v":0},0,{"$f":"$D41*(INDEX(RICHIESTA!$BC$142:$BC$241,MATCH($A41,RICHIESTA!$C$142:$C$241,0))\n+IF($A$1=\"N\",INDEX(RICHIESTA!$BB$142:$BB$241,MATCH($A41,RICHIESTA!$C$142:$C$241,0)),0))","v":0},null,0,0,0,0]
[{"$f":"RICHIESTA!C155","v":14},"UNITA IMMOBILIARE 14",null,1,{"$f":"INDEX(RICHIESTA!$X$142:$X$241,MATCH(A42,RICHIESTA!$C$142:$C$241,0))","v":0},0,0,0,0,{"$f":"INDEX(RICHIESTA!$I$142:$I$241,MATCH(A42,RICHIESTA!$C$142:$C$241,0))","v":"Privata"},null,null,null,null,{"$f":"$D42*(INDEX(RICHIESTA!$BG$142:$BG$241,MATCH($A42,RICHIESTA!$C$142:$C$241,0))\n+$E42*IF($A$1=\"N\",RICHIESTA!$O$128-RICHIESTA!$O$109,0))","v":0},{"$f":"$D42*(INDEX(RICHIESTA!$BA$142:$BA$241,MATCH($A42,RICHIESTA!$C$142:$C$241,0))\n+IF($A$1=\"N\",INDEX(RICHIESTA!$AU$142:$AU$241,MATCH($A42,RICHIESTA!$C$142:$C$241,0))/MAX(RICHIESTA!$AU$140,10^-9)*(RICHIESTA!$AC$128-RICHIESTA!$AC$109),0))","v":0},0,{"$f":"$D42*(INDEX(RICHIESTA!$BC$142:$BC$241,MATCH($A42,RICHIESTA!$C$142:$C$241,0))\n+IF($A$1=\"N\",INDEX(RICHIESTA!$BB$142:$BB$241,MATCH($A42,RICHIESTA!$C$142:$C$241,0)),0))","v":0},null,0,0,0,0]
[{"$f":"RICHIESTA!C156","v":15},"UNITA IMMOBILIARE 15",null,1,{"$f":"INDEX(RICHIESTA!$X$142:$X$241,MATCH(A43,RICHIESTA!$C$142:$C$241,0))","v":0},0,0,0,0,{"$f":"INDEX(RICHIESTA!$I$142:$I$241,MATCH(A43,RICHIESTA!$C$142:$C$241,0))","v":"Privata"},null,null,null,null,{"$f":"$D43*(INDEX(RICHIESTA!$BG$142:$BG$241,MATCH($A43,RICHIESTA!$C$142:$C$241,0))\n+$E43*IF($A$1=\"N\",RICHIESTA!$O$128-RICHIESTA!$O$109,0))","v":0},{"$f":"$D43*(INDEX(RICHIESTA!$BA$142:$BA$241,MATCH($A43,RICHIESTA!$C$142:$C$241,0))\n+IF($A$1=\"N\",INDEX(RICHIESTA!$AU$142:$AU$241,MATCH($A43,RICHIESTA!$C$142:$C$241,0))/MAX(RICHIESTA!$AU$140,10^-9)*(RICHIESTA!$AC$128-RICHIESTA!$AC$109),0))","v":0},0,{"$f":"$D43*(INDEX(RICHIESTA!$BC$142:$BC$241,MATCH($A43,RICHIESTA!$C$142:$C$241,0))\n+IF($A$1=\"N\",INDEX(RICHIESTA!$BB$142:$BB$241,MATCH($A43,RICHIESTA!$C$142:$C$241,0)),0))","v":0},null,0,0,0,0]
[{"$f":"RICHIESTA!C157","v":16},"UNITA IMMOBILIARE 16",null,1,{"$f":"INDEX(RICHIESTA!$X$142:$X$241,MATCH(A44,RICHIESTA!$C$142:$C$241,0))","v":0},0,0,0,0,{"$f":"INDEX(RICHIESTA!$I$142:$I$241,MATCH(A44,RICHIESTA!$C$142:$C$241,0))","v":"Privata"},null,null,null,null,{"$f":"$D44*(INDEX(RICHIESTA!$BG$142:$BG$241,MATCH($A44,RICHIESTA!$C$142:$C$241,0))\n+$E44*IF($A$1=\"N\",RICHIESTA!$O$128-RICHIESTA!$O$109,0))","v":0},{"$f":"$D44*(INDEX(RICHIESTA!$BA$142:$BA$241,MATCH($A44,RICHIESTA!$C$142:$C$241,0))\n+IF($A$1=\"N\",INDEX(RICHIESTA!$AU$142:$AU$241,MATCH($A44,RICHIESTA!$C$142:$C$241,0))/MAX(RICHIESTA!$AU$140,10^-9)*(RICHIESTA!$AC$128-RICHIESTA!$AC$109),0))","v":0},0,{"$f":"$D44*(INDEX(RICHIESTA!$BC$142:$BC$241,MATCH($A44,RICHIESTA!$C$142:$C$241,0))\n+IF($A$1=\"N\",INDEX(RICHIESTA!$BB$142:$BB$241,MATCH($A44,RICHIESTA!$C$142:$C$241,0)),0))","v":0},null,0,0,0,0]
[{"$f":"RICHIESTA!C158","v":17},"UNITA IMMOBILIARE 17",null,1,{"$f":"INDEX(RICHIESTA!$X$142:$X$241,MATCH(A45,RICHIESTA!$C$142:$C$241,0))","v":0},0,0,0,0,{"$f":"INDEX(RICHIESTA!$I$142:$I$241,MATCH(A45,RICHIESTA!$C$142:$C$241,0))","v":"Privata"},null,null,null,null,{"$f":"$D45*(INDEX(RICHIESTA!$BG$142:$BG$241,MATCH($A45,RICHIESTA!$C$142:$C$241,0))\n+$E45*IF($A$1=\"N\",RICHIESTA!$O$128-RICHIESTA!$O$109,0))","v":0},{"$f":"$D45*(INDEX(RICHIESTA!$BA$142:$BA$241,MATCH($A45,RICHIESTA!$C$142:$C$241,0))\n+IF($A$1=\"N\",INDEX(RICHIESTA!$AU$142:$AU$241,MATCH($A45,RICHIESTA!$C$142:$C$241,0))/MAX(RICHIESTA!$AU$140,10^-9)*(RICHIESTA!$AC$128-RICHIESTA!$AC$109),0))","v":0},0,{"$f":"$D45*(INDEX(RICHIESTA!$BC$142:$BC$241,MATCH($A45,RICHIESTA!$C$142:$C$241,0))\n+IF($A$1=\"N\",INDEX(RICHIESTA!$BB$142:$BB$241,MATCH($A45,RICHIESTA!$C$142:$C$241,0)),0))","v":0},null,0,0,0,0]
[{"$f":"RICHIESTA!C159","v":18},"UNITA IMMOBILIARE 18",null,1,{"$f":"INDEX(RICHIESTA!$X$142:$X$241,MATCH(A46,RICHIESTA!$C$142:$C$241,0))","v":0},0,0,0,0,{"$f":"INDEX(RICHIESTA!$I$142:$I$241,MATCH(A46,RICHIESTA!$C$142:$C$241,0))","v":"Privata"},null,null,null,null,{"$f":"$D46*(INDEX(RICHIESTA!$BG$142:$BG$241,MATCH($A46,RICHIESTA!$C$142:$C$241,0))\n+$E46*IF($A$1=\"N\",RICHIESTA!$O$128-RICHIESTA!$O$109,0))","v":0},{"$f":"$D46*(INDEX(RICHIESTA!$BA$142:$BA$241,MATCH($A46,RICHIESTA!$C$142:$C$241,0))\n+IF($A$1=\"N\",INDEX(RICHIESTA!$AU$142:$AU$241,MATCH($A46,RICHIESTA!$C$142:$C$241,0))/MAX(RICHIESTA!$AU$140,10^-9)*(RICHIESTA!$AC$128-RICHIESTA!$AC$109),0))","v":0},0,{"$f":"$D46*(INDEX(RICHIESTA!$BC$142:$BC$241,MATCH($A46,RICHIESTA!$C$142:$C$241,0))\n+IF($A$1=\"N\",INDEX(RICHIESTA!$BB$142:$BB$241,MATCH($A46,RICHIESTA!$C$142:$C$241,0)),0))","v":0},null,0,0,0,0]
[{"$f":"RICHIESTA!C160","v":19},"UNITA IMMOBILIARE 19",null,1,{"$f":"INDEX(RICHIESTA!$X$142:$X$241,MATCH(A47,RICHIESTA!$C$142:$C$241,0))","v":0},0,0,0,0,{"$f":"INDEX(RICHIESTA!$I$142:$I$241,MATCH(A47,RICHIESTA!$C$142:$C$241,0))","v":"Privata"},null,null,null,null,{"$f":"$D47*(INDEX(RICHIESTA!$BG$142:$BG$241,MATCH($A47,RICHIESTA!$C$142:$C$241,0))\n+$E47*IF($A$1=\"N\",RICHIESTA!$O$128-RICHIESTA!$O$109,0))","v":0},{"$f":"$D47*(INDEX(RICHIESTA!$BA$142:$BA$241,MATCH($A47,RICHIESTA!$C$142:$C$241,0))\n+IF($A$1=\"N\",INDEX(RICHIESTA!$AU$142:$AU$241,MATCH($A47,RICHIESTA!$C$142:$C$241,0))/MAX(RICHIESTA!$AU$140,10^-9)*(RICHIESTA!$AC$128-RICHIESTA!$AC$109),0))","v":0},0,{"$f":"$D47*(INDEX(RICHIESTA!$BC$142:$BC$241,MATCH($A47,RICHIESTA!$C$142:$C$241,0))\n+IF($A$1=\"N\",INDEX(RICHIESTA!$BB$142:$BB$241,MATCH($A47,RICHIESTA!$C$142:$C$241,0)),0))","v":0},null,0,0,0,0]
[{"$f":"RICHIESTA!C161","v":20},"UNITA IMMOBILIARE 20",null,1,{"$f":"INDEX(RICHIESTA!$X$142:$X$241,MATCH(A48,RICHIESTA!$C$142:$C$241,0))","v":0},0,0,0,0,{"$f":"INDEX(RICHIESTA!$I$142:$I$241,MATCH(A48,RICHIESTA!$C$142:$C$241,0))","v":"Privata"},null,null,null,null,{"$f":"$D48*(INDEX(RICHIESTA!$BG$142:$BG$241,MATCH($A48,RICHIESTA!$C$142:$C$241,0))\n+$E48*IF($A$1=\"N\",RICHIESTA!$O$128-RICHIESTA!$O$109,0))","v":0},{"$f":"$D48*(INDEX(RICHIESTA!$BA$142:$BA$241,MATCH($A48,RICHIESTA!$C$142:$C$241,0))\n+IF($A$1=\"N\",INDEX(RICHIESTA!$AU$142:$AU$241,MATCH($A48,RICHIESTA!$C$142:$C$241,0))/MAX(RICHIESTA!$AU$140,10^-9)*(RICHIESTA!$AC$128-RICHIESTA!$AC$109),0))","v":0},0,{"$f":"$D48*(INDEX(RICHIESTA!$BC$142:$BC$241,MATCH($A48,RICHIESTA!$C$142:$C$241,0))\n+IF($A$1=\"N\",INDEX(RICHIESTA!$BB$142:$BB$241,MATCH($A48,RICHIESTA!$C$142:$C$241,0)),0))","v":0},null,0,0,0,0]
[{"$f":"RICHIESTA!C162","v":21},"UNITA IMMOBILIARE 21",null,1,{"$f":"INDEX(RICHIESTA!$X$142:$X$241,MATCH(A49,RICHIESTA!$C$142:$C$241,0))","v":0},0,0,0,0,{"$f":"INDEX(RICHIESTA!$I$142:$I$241,MATCH(A49,RICHIESTA!$C$142:$C$241,0))","v":"Privata"},null,null,null,null,{"$f":"$D49*(INDEX(RICHIESTA!$BG$142:$BG$241,MATCH($A49,RICHIESTA!$C$142:$C$241,0))\n+$E49*IF($A$1=\"N\",RICHIESTA!$O$128-RICHIESTA!$O$109,0))","v":0},{"$f":"$D49*(INDEX(RICHIESTA!$BA$142:$BA$241,MATCH($A49,RICHIESTA!$C$142:$C$241,0))\n+IF($A$1=\"N\",INDEX(RICHIESTA!$AU$142:$AU$241,MATCH($A49,RICHIESTA!$C$142:$C$241,0))/MAX(RICHIESTA!$AU$140,10^-9)*(RICHIESTA!$AC$128-RICHIESTA!$AC$109),0))","v":0},0,{"$f":"$D49*(INDEX(RICHIESTA!$BC$142:$BC$241,MATCH($A49,RICHIESTA!$C$142:$C$241,0))\n+IF($A$1=\"N\",INDEX(RICHIESTA!$BB$142:$BB$241,MATCH($A49,RICHIESTA!$C$142:$C$241,0)),0))","v":0},null,0,0,0,0]
[{"$f":"RICHIESTA!C163","v":22},"UNITA IMMOBILIARE 22",null,1,{"$f":"INDEX(RICHIESTA!$X$142:$X$241,MATCH(A50,RICHIESTA!$C$142:$C$241,0))","v":0},0,0,0,0,{"$f":"INDEX(RICHIESTA!$I$142:$I$241,MATCH(A50,RICHIESTA!$C$142:$C$241,0))","v":"Privata"},null,null,null,null,{"$f":"$D50*(INDEX(RICHIESTA!$BG$142:$BG$241,MATCH($A50,RICHIESTA!$C$142:$C$241,0))\n+$E50*IF($A$1=\"N\",RICHIESTA!$O$128-RICHIESTA!$O$109,0))","v":0},{"$f":"$D50*(INDEX(RICHIESTA!$BA$142:$BA$241,MATCH($A50,RICHIESTA!$C$142:$C$241,0))\n+IF($A$1=\"N\",INDEX(RICHIESTA!$AU$142:$AU$241,MATCH($A50,RICHIESTA!$C$142:$C$241,0))/MAX(RICHIESTA!$AU$140,10^-9)*(RICHIESTA!$AC$128-RICHIESTA!$AC$109),0))","v":0},0,{"$f":"$D50*(INDEX(RICHIESTA!$BC$142:$BC$241,MATCH($A50,RICHIESTA!$C$142:$C$241,0))\n+IF($A$1=\"N\",INDEX(RICHIESTA!$BB$142:$BB$241,MATCH($A50,RICHIESTA!$C$142:$C$241,0)),0))","v":0},null,0,0,0,0]
[{"$f":"RICHIESTA!C164","v":23},"UNITA IMMOBILIARE 23",null,1,{"$f":"INDEX(RICHIESTA!$X$142:$X$241,MATCH(A51,RICHIESTA!$C$142:$C$241,0))","v":0},0,0,0,0,{"$f":"INDEX(RICHIESTA!$I$142:$I$241,MATCH(A51,RICHIESTA!$C$142:$C$241,0))","v":"Privata"},null,null,null,null,{"$f":"$D51*(INDEX(RICHIESTA!$BG$142:$BG$241,MATCH($A51,RICHIESTA!$C$142:$C$241,0))\n+$E51*IF($A$1=\"N\",RICHIESTA!$O$128-RICHIESTA!$O$109,0))","v":0},{"$f":"$D51*(INDEX(RICHIESTA!$BA$142:$BA$241,MATCH($A51,RICHIESTA!$C$142:$C$241,0))\n+IF($A$1=\"N\",INDEX(RICHIESTA!$AU$142:$AU$241,MATCH($A51,RICHIESTA!$C$142:$C$241,0))/MAX(RICHIESTA!$AU$140,10^-9)*(RICHIESTA!$AC$128-RICHIESTA!$AC$109),0))","v":0},0,{"$f":"$D51*(INDEX(RICHIESTA!$BC$142:$BC$241,MATCH($A51,RICHIESTA!$C$142:$C$241,0))\n+IF($A$1=\"N\",INDEX(RICHIESTA!$BB$142:$BB$241,MATCH($A51,RICHIESTA!$C$142:$C$241,0)),0))","v":0},null,0,0,0,0]
[{"$f":"RICHIESTA!C165","v":24},"UNITA IMMOBILIARE 24",null,1,{"$f":"INDEX(RICHIESTA!$X$142:$X$241,MATCH(A52,RICHIESTA!$C$142:$C$241,0))","v":0},0,0,0,0,{"$f":"INDEX(RICHIESTA!$I$142:$I$241,MATCH(A52,RICHIESTA!$C$142:$C$241,0))","v":"Privata"},null,null,null,null,{"$f":"$D52*(INDEX(RICHIESTA!$BG$142:$BG$241,MATCH($A52,RICHIESTA!$C$142:$C$241,0))\n+$E52*IF($A$1=\"N\",RICHIESTA!$O$128-RICHIESTA!$O$109,0))","v":0},{"$f":"$D52*(INDEX(RICHIESTA!$BA$142:$BA$241,MATCH($A52,RICHIESTA!$C$142:$C$241,0))\n+IF($A$1=\"N\",INDEX(RICHIESTA!$AU$142:$AU$241,MATCH($A52,RICHIESTA!$C$142:$C$241,0))/MAX(RICHIESTA!$AU$140,10^-9)*(RICHIESTA!$AC$128-RICHIESTA!$AC$109),0))","v":0},0,{"$f":"$D52*(INDEX(RICHIESTA!$BC$142:$BC$241,MATCH($A52,RICHIESTA!$C$142:$C$241,0))\n+IF($A$1=\"N\",INDEX(RICHIESTA!$BB$142:$BB$241,MATCH($A52,RICHIESTA!$C$142:$C$241,0)),0))","v":0},null,0,0,0,0]
[{"$f":"RICHIESTA!C166","v":25},"UNITA IMMOBILIARE 25",null,1,{"$f":"INDEX(RICHIESTA!$X$142:$X$241,MATCH(A53,RICHIESTA!$C$142:$C$241,0))","v":0},0,0,0,0,{"$f":"INDEX(RICHIESTA!$I$142:$I$241,MATCH(A53,RICHIESTA!$C$142:$C$241,0))","v":"Privata"},null,null,null,null,{"$f":"$D53*(INDEX(RICHIESTA!$BG$142:$BG$241,MATCH($A53,RICHIESTA!$C$142:$C$241,0))\n+$E53*IF($A$1=\"N\",RICHIESTA!$O$128-RICHIESTA!$O$109,0))","v":0},{"$f":"$D53*(INDEX(RICHIESTA!$BA$142:$BA$241,MATCH($A53,RICHIESTA!$C$142:$C$241,0))\n+IF($A$1=\"N\",INDEX(RICHIESTA!$AU$142:$AU$241,MATCH($A53,RICHIESTA!$C$142:$C$241,0))/MAX(RICHIESTA!$AU$140,10^-9)*(RICHIESTA!$AC$128-RICHIESTA!$AC$109),0))","v":0},0,{"$f":"$D53*(INDEX(RICHIESTA!$BC$142:$BC$241,MATCH($A53,RICHIESTA!$C$142:$C$241,0))\n+IF($A$1=\"N\",INDEX(RICHIESTA!$BB$142:$BB$241,MATCH($A53,RICHIESTA!$C$142:$C$241,0)),0))","v":0},null,0,0,0,0]
[{"$f":"RICHIESTA!C167","v":26},"UNITA IMMOBILIARE 26",null,1,{"$f":"INDEX(RICHIESTA!$X$142:$X$241,MATCH(A54,RICHIESTA!$C$142:$C$241,0))","v":0},0,0,0,0,{"$f":"INDEX(RICHIESTA!$I$142:$I$241,MATCH(A54,RICHIESTA!$C$142:$C$241,0))","v":"Privata"},null,null,null,null,{"$f":"$D54*(INDEX(RICHIESTA!$BG$142:$BG$241,MATCH($A54,RICHIESTA!$C$142:$C$241,0))\n+$E54*IF($A$1=\"N\",RICHIESTA!$O$128-RICHIESTA!$O$109,0))","v":0},{"$f":"$D54*(INDEX(RICHIESTA!$BA$142:$BA$241,MATCH($A54,RICHIESTA!$C$142:$C$241,0))\n+IF($A$1=\"N\",INDEX(RICHIESTA!$AU$142:$AU$241,MATCH($A54,RICHIESTA!$C$142:$C$241,0))/MAX(RICHIESTA!$AU$140,10^-9)*(RICHIESTA!$AC$128-RICHIESTA!$AC$109),0))","v":0},0,{"$f":"$D54*(INDEX(RICHIESTA!$BC$142:$BC$241,MATCH($A54,RICHIESTA!$C$142:$C$241,0))\n+IF($A$1=\"N\",INDEX(RICHIESTA!$BB$142:$BB$241,MATCH($A54,RICHIESTA!$C$142:$C$241,0)),0))","v":0},null,0,0,0,0]
[{"$f":"RICHIESTA!C168","v":27},"UNITA IMMOBILIARE 27",null,1,{"$f":"INDEX(RICHIESTA!$X$142:$X$241,MATCH(A55,RICHIESTA!$C$142:$C$241,0))","v":0},0,0,0,0,{"$f":"INDEX(RICHIESTA!$I$142:$I$241,MATCH(A55,RICHIESTA!$C$142:$C$241,0))","v":"Privata"},null,null,null,null,{"$f":"$D55*(INDEX(RICHIESTA!$BG$142:$BG$241,MATCH($A55,RICHIESTA!$C$142:$C$241,0))\n+$E55*IF($A$1=\"N\",RICHIESTA!$O$128-RICHIESTA!$O$109,0))","v":0},{"$f":"$D55*(INDEX(RICHIESTA!$BA$142:$BA$241,MATCH($A55,RICHIESTA!$C$142:$C$241,0))\n+IF($A$1=\"N\",INDEX(RICHIESTA!$AU$142:$AU$241,MATCH($A55,RICHIESTA!$C$142:$C$241,0))/MAX(RICHIESTA!$AU$140,10^-9)*(RICHIESTA!$AC$128-RICHIESTA!$AC$109),0))","v":0},0,{"$f":"$D55*(INDEX(RICHIESTA!$BC$142:$BC$241,MATCH($A55,RICHIESTA!$C$142:$C$241,0))\n+IF($A$1=\"N\",INDEX(RICHIESTA!$BB$142:$BB$241,MATCH($A55,RICHIESTA!$C$142:$C$241,0)),0))","v":0},null,0,0,0,0]
[{"$f":"RICHIESTA!C169","v":28},"UNITA IMMOBILIARE 28",null,1,{"$f":"INDEX(RICHIESTA!$X$142:$X$241,MATCH(A56,RICHIESTA!$C$142:$C$241,0))","v":0},0,0,0,0,{"$f":"INDEX(RICHIESTA!$I$142:$I$241,MATCH(A56,RICHIESTA!$C$142:$C$241,0))","v":"Privata"},null,null,null,null,{"$f":"$D56*(INDEX(RICHIESTA!$BG$142:$BG$241,MATCH($A56,RICHIESTA!$C$142:$C$241,0))\n+$E56*IF($A$1=\"N\",RICHIESTA!$O$128-RICHIESTA!$O$109,0))","v":0},{"$f":"$D56*(INDEX(RICHIESTA!$BA$142:$BA$241,MATCH($A56,RICHIESTA!$C$142:$C$241,0))\n+IF($A$1=\"N\",INDEX(RICHIESTA!$AU$142:$AU$241,MATCH($A56,RICHIESTA!$C$142:$C$241,0))/MAX(RICHIESTA!$AU$140,10^-9)*(RICHIESTA!$AC$128-RICHIESTA!$AC$109),0))","v":0},0,{"$f":"$D56*(INDEX(RICHIESTA!$BC$142:$BC$241,MATCH($A56,RICHIESTA!$C$142:$C$241,0))\n+IF($A$1=\"N\",INDEX(RICHIESTA!$BB$142:$BB$241,MATCH($A56,RICHIESTA!$C$142:$C$241,0)),0))","v":0},null,0,0,0,0]
[{"$f":"RICHIESTA!C170","v":29},"UNITA IMMOBILIARE 29",null,1,{"$f":"INDEX(RICHIESTA!$X$142:$X$241,MATCH(A57,RICHIESTA!$C$142:$C$241,0))","v":0},0,0,0,0,{"$f":"INDEX(RICHIESTA!$I$142:$I$241,MATCH(A57,RICHIESTA!$C$142:$C$241,0))","v":"Privata"},null,null,null,null,{"$f":"$D57*(INDEX(RICHIESTA!$BG$142:$BG$241,MATCH($A57,RICHIESTA!$C$142:$C$241,0))\n+$E57*IF($A$1=\"N\",RICHIESTA!$O$128-RICHIESTA!$O$109,0))","v":0},{"$f":"$D57*(INDEX(RICHIESTA!$BA$142:$BA$241,MATCH($A57,RICHIESTA!$C$142:$C$241,0))\n+IF($A$1=\"N\",INDEX(RICHIESTA!$AU$142:$AU$241,MATCH($A57,RICHIESTA!$C$142:$C$241,0))/MAX(RICHIESTA!$AU$140,10^-9)*(RICHIESTA!$AC$128-RICHIESTA!$AC$109),0))","v":0},0,{"$f":"$D57*(INDEX(RICHIESTA!$BC$142:$BC$241,MATCH($A57,RICHIESTA!$C$142:$C$241,0))\n+IF($A$1=\"N\",INDEX(RICHIESTA!$BB$142:$BB$241,MATCH($A57,RICHIESTA!$C$142:$C$241,0)),0))","v":0},null,0,0,0,0]
[{"$f":"RICHIESTA!C171","v":30},"UNITA IMMOBILIARE 30",null,1,{"$f":"INDEX(RICHIESTA!$X$142:$X$241,MATCH(A58,RICHIESTA!$C$142:$C$241,0))","v":0},0,0,0,0,{"$f":"INDEX(RICHIESTA!$I$142:$I$241,MATCH(A58,RICHIESTA!$C$142:$C$241,0))","v":"Privata"},null,null,null,null,{"$f":"$D58*(INDEX(RICHIESTA!$BG$142:$BG$241,MATCH($A58,RICHIESTA!$C$142:$C$241,0))\n+$E58*IF($A$1=\"N\",RICHIESTA!$O$128-RICHIESTA!$O$109,0))","v":0},{"$f":"$D58*(INDEX(RICHIESTA!$BA$142:$BA$241,MATCH($A58,RICHIESTA!$C$142:$C$241,0))\n+IF($A$1=\"N\",INDEX(RICHIESTA!$AU$142:$AU$241,MATCH($A58,RICHIESTA!$C$142:$C$241,0))/MAX(RICHIESTA!$AU$140,10^-9)*(RICHIESTA!$AC$128-RICHIESTA!$AC$109),0))","v":0},0,{"$f":"$D58*(INDEX(RICHIESTA!$BC$142:$BC$241,MATCH($A58,RICHIESTA!$C$142:$C$241,0))\n+IF($A$1=\"N\",INDEX(RICHIESTA!$BB$142:$BB$241,MATCH($A58,RICHIESTA!$C$142:$C$241,0)),0))","v":0},null,0,0,0,0]
[{"$f":"RICHIESTA!C172","v":31},"UNITA IMMOBILIARE 31",null,1,{"$f":"INDEX(RICHIESTA!$X$142:$X$241,MATCH(A59,RICHIESTA!$C$142:$C$241,0))","v":0},0,0,0,0,{"$f":"INDEX(RICHIESTA!$I$142:$I$241,MATCH(A59,RICHIESTA!$C$142:$C$241,0))","v":"Privata"},null,null,null,null,{"$f":"$D59*(INDEX(RICHIESTA!$BG$142:$BG$241,MATCH($A59,RICHIESTA!$C$142:$C$241,0))\n+$E59*IF($A$1=\"N\",RICHIESTA!$O$128-RICHIESTA!$O$109,0))","v":0},{"$f":"$D59*(INDEX(RICHIESTA!$BA$142:$BA$241,MATCH($A59,RICHIESTA!$C$142:$C$241,0))\n+IF($A$1=\"N\",INDEX(RICHIESTA!$AU$142:$AU$241,MATCH($A59,RICHIESTA!$C$142:$C$241,0))/MAX(RICHIESTA!$AU$140,10^-9)*(RICHIESTA!$AC$128-RICHIESTA!$AC$109),0))","v":0},0,{"$f":"$D59*(INDEX(RICHIESTA!$BC$142:$BC$241,MATCH($A59,RICHIESTA!$C$142:$C$241,0))\n+IF($A$1=\"N\",INDEX(RICHIESTA!$BB$142:$BB$241,MATCH($A59,RICHIESTA!$C$142:$C$241,0)),0))","v":0},null,0,0,0,0]
[{"$f":"RICHIESTA!C173","v":32},"UNITA IMMOBILIARE 32",null,1,{"$f":"INDEX(RICHIESTA!$X$142:$X$241,MATCH(A60,RICHIESTA!$C$142:$C$241,0))","v":0},0,0,0,0,{"$f":"INDEX(RICHIESTA!$I$142:$I$241,MATCH(A60,RICHIESTA!$C$142:$C$241,0))","v":"Privata"},null,null,null,null,{"$f":"$D60*(INDEX(RICHIESTA!$BG$142:$BG$241,MATCH($A60,RICHIESTA!$C$142:$C$241,0))\n+$E60*IF($A$1=\"N\",RICHIESTA!$O$128-RICHIESTA!$O$109,0))","v":0},{"$f":"$D60*(INDEX(RICHIESTA!$BA$142:$BA$241,MATCH($A60,RICHIESTA!$C$142:$C$241,0))\n+IF($A$1=\"N\",INDEX(RICHIESTA!$AU$142:$AU$241,MATCH($A60,RICHIESTA!$C$142:$C$241,0))/MAX(RICHIESTA!$AU$140,10^-9)*(RICHIESTA!$AC$128-RICHIESTA!$AC$109),0))","v":0},0,{"$f":"$D60*(INDEX(RICHIESTA!$BC$142:$BC$241,MATCH($A60,RICHIESTA!$C$142:$C$241,0))\n+IF($A$1=\"N\",INDEX(RICHIESTA!$BB$142:$BB$241,MATCH($A60,RICHIESTA!$C$142:$C$241,0)),0))","v":0},null,0,0,0,0]
[{"$f":"RICHIESTA!C174","v":33},"UNITA IMMOBILIARE 33",null,1,{"$f":"INDEX(RICHIESTA!$X$142:$X$241,MATCH(A61,RICHIESTA!$C$142:$C$241,0))","v":0},0,0,0,0,{"$f":"INDEX(RICHIESTA!$I$142:$I$241,MATCH(A61,RICHIESTA!$C$142:$C$241,0))","v":"Privata"},null,null,null,null,{"$f":"$D61*(INDEX(RICHIESTA!$BG$142:$BG$241,MATCH($A61,RICHIESTA!$C$142:$C$241,0))\n+$E61*IF($A$1=\"N\",RICHIESTA!$O$128-RICHIESTA!$O$109,0))","v":0},{"$f":"$D61*(INDEX(RICHIESTA!$BA$142:$BA$241,MATCH($A61,RICHIESTA!$C$142:$C$241,0))\n+IF($A$1=\"N\",INDEX(RICHIESTA!$AU$142:$AU$241,MATCH($A61,RICHIESTA!$C$142:$C$241,0))/MAX(RICHIESTA!$AU$140,10^-9)*(RICHIESTA!$AC$128-RICHIESTA!$AC$109),0))","v":0},0,{"$f":"$D61*(INDEX(RICHIESTA!$BC$142:$BC$241,MATCH($A61,RICHIESTA!$C$142:$C$241,0))\n+IF($A$1=\"N\",INDEX(RICHIESTA!$BB$142:$BB$241,MATCH($A61,RICHIESTA!$C$142:$C$241,0)),0))","v":0},null,0,0,0,0]
[{"$f":"RICHIESTA!C175","v":34},"UNITA IMMOBILIARE 34",null,1,{"$f":"INDEX(RICHIESTA!$X$142:$X$241,MATCH(A62,RICHIESTA!$C$142:$C$241,0))","v":0},0,0,0,0,{"$f":"INDEX(RICHIESTA!$I$142:$I$241,MATCH(A62,RICHIESTA!$C$142:$C$241,0))","v":"Privata"},null,null,null,null,{"$f":"$D62*(INDEX(RICHIESTA!$BG$142:$BG$241,MATCH($A62,RICHIESTA!$C$142:$C$241,0))\n+$E62*IF($A$1=\"N\",RICHIESTA!$O$128-RICHIESTA!$O$109,0))","v":0},{"$f":"$D62*(INDEX(RICHIESTA!$BA$142:$BA$241,MATCH($A62,RICHIESTA!$C$142:$C$241,0))\n+IF($A$1=\"N\",INDEX(RICHIESTA!$AU$142:$AU$241,MATCH($A62,RICHIESTA!$C$142:$C$241,0))/MAX(RICHIESTA!$AU$140,10^-9)*(RICHIESTA!$AC$128-RICHIESTA!$AC$109),0))","v":0},0,{"$f":"$D62*(INDEX(RICHIESTA!$BC$142:$BC$241,MATCH($A62,RICHIESTA!$C$142:$C$241,0))\n+IF($A$1=\"N\",INDEX(RICHIESTA!$BB$142:$BB$241,MATCH($A62,RICHIESTA!$C$142:$C$241,0)),0))","v":0},null,0,0,0,0]
[{"$f":"RICHIESTA!C176","v":35},"UNITA IMMOBILIARE 35",null,1,{"$f":"INDEX(RICHIESTA!$X$142:$X$241,MATCH(A63,RICHIESTA!$C$142:$C$241,0))","v":0},0,0,0,0,{"$f":"INDEX(RICHIESTA!$I$142:$I$241,MATCH(A63,RICHIESTA!$C$142:$C$241,0))","v":"Privata"},null,null,null,null,{"$f":"$D63*(INDEX(RICHIESTA!$BG$142:$BG$241,MATCH($A63,RICHIESTA!$C$142:$C$241,0))\n+$E63*IF($A$1=\"N\",RICHIESTA!$O$128-RICHIESTA!$O$109,0))","v":0},{"$f":"$D63*(INDEX(RICHIESTA!$BA$142:$BA$241,MATCH($A63,RICHIESTA!$C$142:$C$241,0))\n+IF($A$1=\"N\",INDEX(RICHIESTA!$AU$142:$AU$241,MATCH($A63,RICHIESTA!$C$142:$C$241,0))/MAX(RICHIESTA!$AU$140,10^-9)*(RICHIESTA!$AC$128-RICHIESTA!$AC$109),0))","v":0},0,{"$f":"$D63*(INDEX(RICHIESTA!$BC$142:$BC$241,MATCH($A63,RICHIESTA!$C$142:$C$241,0))\n+IF($A$1=\"N\",INDEX(RICHIESTA!$BB$142:$BB$241,MATCH($A63,RICHIESTA!$C$142:$C$241,0)),0))","v":0},null,0,0,0,0]
[{"$f":"RICHIESTA!C177","v":36},"UNITA IMMOBILIARE 36",null,1,{"$f":"INDEX(RICHIESTA!$X$142:$X$241,MATCH(A64,RICHIESTA!$C$142:$C$241,0))","v":0},0,0,0,0,{"$f":"INDEX(RICHIESTA!$I$142:$I$241,MATCH(A64,RICHIESTA!$C$142:$C$241,0))","v":"Privata"},null,null,null,null,{"$f":"$D64*(INDEX(RICHIESTA!$BG$142:$BG$241,MATCH($A64,RICHIESTA!$C$142:$C$241,0))\n+$E64*IF($A$1=\"N\",RICHIESTA!$O$128-RICHIESTA!$O$109,0))","v":0},{"$f":"$D64*(INDEX(RICHIESTA!$BA$142:$BA$241,MATCH($A64,RICHIESTA!$C$142:$C$241,0))\n+IF($A$1=\"N\",INDEX(RICHIESTA!$AU$142:$AU$241,MATCH($A64,RICHIESTA!$C$142:$C$241,0))/MAX(RICHIESTA!$AU$140,10^-9)*(RICHIESTA!$AC$128-RICHIESTA!$AC$109),0))","v":0},0,{"$f":"$D64*(INDEX(RICHIESTA!$BC$142:$BC$241,MATCH($A64,RICHIESTA!$C$142:$C$241,0))\n+IF($A$1=\"N\",INDEX(RICHIESTA!$BB$142:$BB$241,MATCH($A64,RICHIESTA!$C$142:$C$241,0)),0))","v":0},null,0,0,0,0]
[{"$f":"RICHIESTA!C178","v":37},"UNITA IMMOBILIARE 37",null,1,{"$f":"INDEX(RICHIESTA!$X$142:$X$241,MATCH(A65,RICHIESTA!$C$142:$C$241,0))","v":0},0,0,0,0,{"$f":"INDEX(RICHIESTA!$I$142:$I$241,MATCH(A65,RICHIESTA!$C$142:$C$241,0))","v":"Privata"},null,null,null,null,{"$f":"$D65*(INDEX(RICHIESTA!$BG$142:$BG$241,MATCH($A65,RICHIESTA!$C$142:$C$241,0))\n+$E65*IF($A$1=\"N\",RICHIESTA!$O$128-RICHIESTA!$O$109,0))","v":0},{"$f":"$D65*(INDEX(RICHIESTA!$BA$142:$BA$241,MATCH($A65,RICHIESTA!$C$142:$C$241,0))\n+IF($A$1=\"N\",INDEX(RICHIESTA!$AU$142:$AU$241,MATCH($A65,RICHIESTA!$C$142:$C$241,0))/MAX(RICHIESTA!$AU$140,10^-9)*(RICHIESTA!$AC$128-RICHIESTA!$AC$109),0))","v":0},0,{"$f":"$D65*(INDEX(RICHIESTA!$BC$142:$BC$241,MATCH($A65,RICHIESTA!$C$142:$C$241,0))\n+IF($A$1=\"N\",INDEX(RICHIESTA!$BB$142:$BB$241,MATCH($A65,RICHIESTA!$C$142:$C$241,0)),0))","v":0},null,0,0,0,0]
[{"$f":"RICHIESTA!C179","v":38},"UNITA IMMOBILIARE 38",null,1,{"$f":"INDEX(RICHIESTA!$X$142:$X$241,MATCH(A66,RICHIESTA!$C$142:$C$241,0))","v":0},0,0,0,0,{"$f":"INDEX(RICHIESTA!$I$142:$I$241,MATCH(A66,RICHIESTA!$C$142:$C$241,0))","v":"Privata"},null,null,null,null,{"$f":"$D66*(INDEX(RICHIESTA!$BG$142:$BG$241,MATCH($A66,RICHIESTA!$C$142:$C$241,0))\n+$E66*IF($A$1=\"N\",RICHIESTA!$O$128-RICHIESTA!$O$109,0))","v":0},{"$f":"$D66*(INDEX(RICHIESTA!$BA$142:$BA$241,MATCH($A66,RICHIESTA!$C$142:$C$241,0))\n+IF($A$1=\"N\",INDEX(RICHIESTA!$AU$142:$AU$241,MATCH($A66,RICHIESTA!$C$142:$C$241,0))/MAX(RICHIESTA!$AU$140,10^-9)*(RICHIESTA!$AC$128-RICHIESTA!$AC$109),0))","v":0},0,{"$f":"$D66*(INDEX(RICHIESTA!$BC$142:$BC$241,MATCH($A66,RICHIESTA!$C$142:$C$241,0))\n+IF($A$1=\"N\",INDEX(RICHIESTA!$BB$142:$BB$241,MATCH($A66,RICHIESTA!$C$142:$C$241,0)),0))","v":0},null,0,0,0,0]
[{"$f":"RICHIESTA!C180","v":39},"UNITA IMMOBILIARE 39",null,1,{"$f":"INDEX(RICHIESTA!$X$142:$X$241,MATCH(A67,RICHIESTA!$C$142:$C$241,0))","v":0},0,0,0,0,{"$f":"INDEX(RICHIESTA!$I$142:$I$241,MATCH(A67,RICHIESTA!$C$142:$C$241,0))","v":"Privata"},null,null,null,null,{"$f":"$D67*(INDEX(RICHIESTA!$BG$142:$BG$241,MATCH($A67,RICHIESTA!$C$142:$C$241,0))\n+$E67*IF($A$1=\"N\",RICHIESTA!$O$128-RICHIESTA!$O$109,0))","v":0},{"$f":"$D67*(INDEX(RICHIESTA!$BA$142:$BA$241,MATCH($A67,RICHIESTA!$C$142:$C$241,0))\n+IF($A$1=\"N\",INDEX(RICHIESTA!$AU$142:$AU$241,MATCH($A67,RICHIESTA!$C$142:$C$241,0))/MAX(RICHIESTA!$AU$140,10^-9)*(RICHIESTA!$AC$128-RICHIESTA!$AC$109),0))","v":0},0,{"$f":"$D67*(INDEX(RICHIESTA!$BC$142:$BC$241,MATCH($A67,RICHIESTA!$C$142:$C$241,0))\n+IF($A$1=\"N\",INDEX(RICHIESTA!$BB$142:$BB$241,MATCH($A67,RICHIESTA!$C$142:$C$241,0)),0))","v":0},null,0,0,0,0]
[{"$f":"RICHIESTA!C181","v":40},"UNITA IMMOBILIARE 40",null,1,{"$f":"INDEX(RICHIESTA!$X$142:$X$241,MATCH(A68,RICHIESTA!$C$142:$C$241,0))","v":0},0,0,0,0,{"$f":"INDEX(RICHIESTA!$I$142:$I$241,MATCH(A68,RICHIESTA!$C$142:$C$241,0))","v":"Privata"},null,null,null,null,{"$f":"$D68*(INDEX(RICHIESTA!$BG$142:$BG$241,MATCH($A68,RICHIESTA!$C$142:$C$241,0))\n+$E68*IF($A$1=\"N\",RICHIESTA!$O$128-RICHIESTA!$O$109,0))","v":0},{"$f":"$D68*(INDEX(RICHIESTA!$BA$142:$BA$241,MATCH($A68,RICHIESTA!$C$142:$C$241,0))\n+IF($A$1=\"N\",INDEX(RICHIESTA!$AU$142:$AU$241,MATCH($A68,RICHIESTA!$C$142:$C$241,0))/MAX(RICHIESTA!$AU$140,10^-9)*(RICHIESTA!$AC$128-RICHIESTA!$AC$109),0))","v":0},0,{"$f":"$D68*(INDEX(RICHIESTA!$BC$142:$BC$241,MATCH($A68,RICHIESTA!$C$142:$C$241,0))\n+IF($A$1=\"N\",INDEX(RICHIESTA!$BB$142:$BB$241,MATCH($A68,RICHIESTA!$C$142:$C$241,0)),0))","v":0},null,0,0,0,0]
[{"$f":"RICHIESTA!C182","v":41},"UNITA IMMOBILIARE 41",null,1,{"$f":"INDEX(RICHIESTA!$X$142:$X$241,MATCH(A69,RICHIESTA!$C$142:$C$241,0))","v":0},0,0,0,0,{"$f":"INDEX(RICHIESTA!$I$142:$I$241,MATCH(A69,RICHIESTA!$C$142:$C$241,0))","v":"Privata"},null,null,null,null,{"$f":"$D69*(INDEX(RICHIESTA!$BG$142:$BG$241,MATCH($A69,RICHIESTA!$C$142:$C$241,0))\n+$E69*IF($A$1=\"N\",RICHIESTA!$O$128-RICHIESTA!$O$109,0))","v":0},{"$f":"$D69*(INDEX(RICHIESTA!$BA$142:$BA$241,MATCH($A69,RICHIESTA!$C$142:$C$241,0))\n+IF($A$1=\"N\",INDEX(RICHIESTA!$AU$142:$AU$241,MATCH($A69,RICHIESTA!$C$142:$C$241,0))/MAX(RICHIESTA!$AU$140,10^-9)*(RICHIESTA!$AC$128-RICHIESTA!$AC$109),0))","v":0},0,{"$f":"$D69*(INDEX(RICHIESTA!$BC$142:$BC$241,MATCH($A69,RICHIESTA!$C$142:$C$241,0))\n+IF($A$1=\"N\",INDEX(RICHIESTA!$BB$142:$BB$241,MATCH($A69,RICHIESTA!$C$142:$C$241,0)),0))","v":0},null,0,0,0,0]
[{"$f":"RICHIESTA!C183","v":42},"UNITA IMMOBILIARE 42",null,1,{"$f":"INDEX(RICHIESTA!$X$142:$X$241,MATCH(A70,RICHIESTA!$C$142:$C$241,0))","v":0},0,0,0,0,{"$f":"INDEX(RICHIESTA!$I$142:$I$241,MATCH(A70,RICHIESTA!$C$142:$C$241,0))","v":"Privata"},null,null,null,null,{"$f":"$D70*(INDEX(RICHIESTA!$BG$142:$BG$241,MATCH($A70,RICHIESTA!$C$142:$C$241,0))\n+$E70*IF($A$1=\"N\",RICHIESTA!$O$128-RICHIESTA!$O$109,0))","v":0},{"$f":"$D70*(INDEX(RICHIESTA!$BA$142:$BA$241,MATCH($A70,RICHIESTA!$C$142:$C$241,0))\n+IF($A$1=\"N\",INDEX(RICHIESTA!$AU$142:$AU$241,MATCH($A70,RICHIESTA!$C$142:$C$241,0))/MAX(RICHIESTA!$AU$140,10^-9)*(RICHIESTA!$AC$128-RICHIESTA!$AC$109),0))","v":0},0,{"$f":"$D70*(INDEX(RICHIESTA!$BC$142:$BC$241,MATCH($A70,RICHIESTA!$C$142:$C$241,0))\n+IF($A$1=\"N\",INDEX(RICHIESTA!$BB$142:$BB$241,MATCH($A70,RICHIESTA!$C$142:$C$241,0)),0))","v":0},null,0,0,0,0]
[{"$f":"RICHIESTA!C184","v":43},"UNITA IMMOBILIARE 43",null,1,{"$f":"INDEX(RICHIESTA!$X$142:$X$241,MATCH(A71,RICHIESTA!$C$142:$C$241,0))","v":0},0,0,0,0,{"$f":"INDEX(RICHIESTA!$I$142:$I$241,MATCH(A71,RICHIESTA!$C$142:$C$241,0))","v":"Privata"},null,null,null,null,{"$f":"$D71*(INDEX(RICHIESTA!$BG$142:$BG$241,MATCH($A71,RICHIESTA!$C$142:$C$241,0))\n+$E71*IF($A$1=\"N\",RICHIESTA!$O$128-RICHIESTA!$O$109,0))","v":0},{"$f":"$D71*(INDEX(RICHIESTA!$BA$142:$BA$241,MATCH($A71,RICHIESTA!$C$142:$C$241,0))\n+IF($A$1=\"N\",INDEX(RICHIESTA!$AU$142:$AU$241,MATCH($A71,RICHIESTA!$C$142:$C$241,0))/MAX(RICHIESTA!$AU$140,10^-9)*(RICHIESTA!$AC$128-RICHIESTA!$AC$109),0))","v":0},0,{"$f":"$D71*(INDEX(RICHIESTA!$BC$142:$BC$241,MATCH($A71,RICHIESTA!$C$142:$C$241,0))\n+IF($A$1=\"N\",INDEX(RICHIESTA!$BB$142:$BB$241,MATCH($A71,RICHIESTA!$C$142:$C$241,0)),0))","v":0},null,0,0,0,0]
[{"$f":"RICHIESTA!C185","v":44},"UNITA IMMOBILIARE 44",null,1,{"$f":"INDEX(RICHIESTA!$X$142:$X$241,MATCH(A72,RICHIESTA!$C$142:$C$241,0))","v":0},0,0,0,0,{"$f":"INDEX(RICHIESTA!$I$142:$I$241,MATCH(A72,RICHIESTA!$C$142:$C$241,0))","v":"Privata"},null,null,null,null,{"$f":"$D72*(INDEX(RICHIESTA!$BG$142:$BG$241,MATCH($A72,RICHIESTA!$C$142:$C$241,0))\n+$E72*IF($A$1=\"N\",RICHIESTA!$O$128-RICHIESTA!$O$109,0))","v":0},{"$f":"$D72*(INDEX(RICHIESTA!$BA$142:$BA$241,MATCH($A72,RICHIESTA!$C$142:$C$241,0))\n+IF($A$1=\"N\",INDEX(RICHIESTA!$AU$142:$AU$241,MATCH($A72,RICHIESTA!$C$142:$C$241,0))/MAX(RICHIESTA!$AU$140,10^-9)*(RICHIESTA!$AC$128-RICHIESTA!$AC$109),0))","v":0},0,{"$f":"$D72*(INDEX(RICHIESTA!$BC$142:$BC$241,MATCH($A72,RICHIESTA!$C$142:$C$241,0))\n+IF($A$1=\"N\",INDEX(RICHIESTA!$BB$142:$BB$241,MATCH($A72,RICHIESTA!$C$142:$C$241,0)),0))","v":0},null,0,0,0,0]
[{"$f":"RICHIESTA!C186","v":45},"UNITA IMMOBILIARE 45",null,1,{"$f":"INDEX(RICHIESTA!$X$142:$X$241,MATCH(A73,RICHIESTA!$C$142:$C$241,0))","v":0},0,0,0,0,{"$f":"INDEX(RICHIESTA!$I$142:$I$241,MATCH(A73,RICHIESTA!$C$142:$C$241,0))","v":"Privata"},null,null,null,null,{"$f":"$D73*(INDEX(RICHIESTA!$BG$142:$BG$241,MATCH($A73,RICHIESTA!$C$142:$C$241,0))\n+$E73*IF($A$1=\"N\",RICHIESTA!$O$128-RICHIESTA!$O$109,0))","v":0},{"$f":"$D73*(INDEX(RICHIESTA!$BA$142:$BA$241,MATCH($A73,RICHIESTA!$C$142:$C$241,0))\n+IF($A$1=\"N\",INDEX(RICHIESTA!$AU$142:$AU$241,MATCH($A73,RICHIESTA!$C$142:$C$241,0))/MAX(RICHIESTA!$AU$140,10^-9)*(RICHIESTA!$AC$128-RICHIESTA!$AC$109),0))","v":0},0,{"$f":"$D73*(INDEX(RICHIESTA!$BC$142:$BC$241,MATCH($A73,RICHIESTA!$C$142:$C$241,0))\n+IF($A$1=\"N\",INDEX(RICHIESTA!$BB$142:$BB$241,MATCH($A73,RICHIESTA!$C$142:$C$241,0)),0))","v":0},null,0,0,0,0]
[{"$f":"RICHIESTA!C187","v":46},"UNITA IMMOBILIARE 46",null,1,{"$f":"INDEX(RICHIESTA!$X$142:$X$241,MATCH(A74,RICHIESTA!$C$142:$C$241,0))","v":0},0,0,0,0,{"$f":"INDEX(RICHIESTA!$I$142:$I$241,MATCH(A74,RICHIESTA!$C$142:$C$241,0))","v":"Privata"},null,null,null,null,{"$f":"$D74*(INDEX(RICHIESTA!$BG$142:$BG$241,MATCH($A74,RICHIESTA!$C$142:$C$241,0))\n+$E74*IF($A$1=\"N\",RICHIESTA!$O$128-RICHIESTA!$O$109,0))","v":0},{"$f":"$D74*(INDEX(RICHIESTA!$BA$142:$BA$241,MATCH($A74,RICHIESTA!$C$142:$C$241,0))\n+IF($A$1=\"N\",INDEX(RICHIESTA!$AU$142:$AU$241,MATCH($A74,RICHIESTA!$C$142:$C$241,0))/MAX(RICHIESTA!$AU$140,10^-9)*(RICHIESTA!$AC$128-RICHIESTA!$AC$109),0))","v":0},0,{"$f":"$D74*(INDEX(RICHIESTA!$BC$142:$BC$241,MATCH($A74,RICHIESTA!$C$142:$C$241,0))\n+IF($A$1=\"N\",INDEX(RICHIESTA!$BB$142:$BB$241,MATCH($A74,RICHIESTA!$C$142:$C$241,0)),0))","v":0},null,0,0,0,0]
[{"$f":"RICHIESTA!C188","v":47},"UNITA IMMOBILIARE 47",null,1,{"$f":"INDEX(RICHIESTA!$X$142:$X$241,MATCH(A75,RICHIESTA!$C$142:$C$241,0))","v":0},0,0,0,0,{"$f":"INDEX(RICHIESTA!$I$142:$I$241,MATCH(A75,RICHIESTA!$C$142:$C$241,0))","v":"Privata"},null,null,null,null,{"$f":"$D75*(INDEX(RICHIESTA!$BG$142:$BG$241,MATCH($A75,RICHIESTA!$C$142:$C$241,0))\n+$E75*IF($A$1=\"N\",RICHIESTA!$O$128-RICHIESTA!$O$109,0))","v":0},{"$f":"$D75*(INDEX(RICHIESTA!$BA$142:$BA$241,MATCH($A75,RICHIESTA!$C$142:$C$241,0))\n+IF($A$1=\"N\",INDEX(RICHIESTA!$AU$142:$AU$241,MATCH($A75,RICHIESTA!$C$142:$C$241,0))/MAX(RICHIESTA!$AU$140,10^-9)*(RICHIESTA!$AC$128-RICHIESTA!$AC$109),0))","v":0},0,{"$f":"$D75*(INDEX(RICHIESTA!$BC$142:$BC$241,MATCH($A75,RICHIESTA!$C$142:$C$241,0))\n+IF($A$1=\"N\",INDEX(RICHIESTA!$BB$142:$BB$241,MATCH($A75,RICHIESTA!$C$142:$C$241,0)),0))","v":0},null,0,0,0,0]
[{"$f":"RICHIESTA!C189","v":48},"UNITA IMMOBILIARE 48",null,1,{"$f":"INDEX(RICHIESTA!$X$142:$X$241,MATCH(A76,RICHIESTA!$C$142:$C$241,0))","v":0},0,0,0,0,{"$f":"INDEX(RICHIESTA!$I$142:$I$241,MATCH(A76,RICHIESTA!$C$142:$C$241,0))","v":"Privata"},null,null,null,null,{"$f":"$D76*(INDEX(RICHIESTA!$BG$142:$BG$241,MATCH($A76,RICHIESTA!$C$142:$C$241,0))\n+$E76*IF($A$1=\"N\",RICHIESTA!$O$128-RICHIESTA!$O$109,0))","v":0},{"$f":"$D76*(INDEX(RICHIESTA!$BA$142:$BA$241,MATCH($A76,RICHIESTA!$C$142:$C$241,0))\n+IF($A$1=\"N\",INDEX(RICHIESTA!$AU$142:$AU$241,MATCH($A76,RICHIESTA!$C$142:$C$241,0))/MAX(RICHIESTA!$AU$140,10^-9)*(RICHIESTA!$AC$128-RICHIESTA!$AC$109),0))","v":0},0,{"$f":"$D76*(INDEX(RICHIESTA!$BC$142:$BC$241,MATCH($A76,RICHIESTA!$C$142:$C$241,0))\n+IF($A$1=\"N\",INDEX(RICHIESTA!$BB$142:$BB$241,MATCH($A76,RICHIESTA!$C$142:$C$241,0)),0))","v":0},null,0,0,0,0]
[{"$f":"RICHIESTA!C190","v":49},"UNITA IMMOBILIARE 49",null,1,{"$f":"INDEX(RICHIESTA!$X$142:$X$241,MATCH(A77,RICHIESTA!$C$142:$C$241,0))","v":0},0,0,0,0,{"$f":"INDEX(RICHIESTA!$I$142:$I$241,MATCH(A77,RICHIESTA!$C$142:$C$241,0))","v":"Privata"},null,null,null,null,{"$f":"$D77*(INDEX(RICHIESTA!$BG$142:$BG$241,MATCH($A77,RICHIESTA!$C$142:$C$241,0))\n+$E77*IF($A$1=\"N\",RICHIESTA!$O$128-RICHIESTA!$O$109,0))","v":0},{"$f":"$D77*(INDEX(RICHIESTA!$BA$142:$BA$241,MATCH($A77,RICHIESTA!$C$142:$C$241,0))\n+IF($A$1=\"N\",INDEX(RICHIESTA!$AU$142:$AU$241,MATCH($A77,RICHIESTA!$C$142:$C$241,0))/MAX(RICHIESTA!$AU$140,10^-9)*(RICHIESTA!$AC$128-RICHIESTA!$AC$109),0))","v":0},0,{"$f":"$D77*(INDEX(RICHIESTA!$BC$142:$BC$241,MATCH($A77,RICHIESTA!$C$142:$C$241,0))\n+IF($A$1=\"N\",INDEX(RICHIESTA!$BB$142:$BB$241,MATCH($A77,RICHIESTA!$C$142:$C$241,0)),0))","v":0},null,0,0,0,0]
[{"$f":"RICHIESTA!C191","v":50},"UNITA IMMOBILIARE 50",null,1,{"$f":"INDEX(RICHIESTA!$X$142:$X$241,MATCH(A78,RICHIESTA!$C$142:$C$241,0))","v":0},0,0,0,0,{"$f":"INDEX(RICHIESTA!$I$142:$I$241,MATCH(A78,RICHIESTA!$C$142:$C$241,0))","v":"Privata"},null,null,null,null,{"$f":"$D78*(INDEX(RICHIESTA!$BG$142:$BG$241,MATCH($A78,RICHIESTA!$C$142:$C$241,0))\n+$E78*IF($A$1=\"N\",RICHIESTA!$O$128-RICHIESTA!$O$109,0))","v":0},{"$f":"$D78*(INDEX(RICHIESTA!$BA$142:$BA$241,MATCH($A78,RICHIESTA!$C$142:$C$241,0))\n+IF($A$1=\"N\",INDEX(RICHIESTA!$AU$142:$AU$241,MATCH($A78,RICHIESTA!$C$142:$C$241,0))/MAX(RICHIESTA!$AU$140,10^-9)*(RICHIESTA!$AC$128-RICHIESTA!$AC$109),0))","v":0},0,{"$f":"$D78*(INDEX(RICHIESTA!$BC$142:$BC$241,MATCH($A78,RICHIESTA!$C$142:$C$241,0))\n+IF($A$1=\"N\",INDEX(RICHIESTA!$BB$142:$BB$241,MATCH($A78,RICHIESTA!$C$142:$C$241,0)),0))","v":0},null,0,0,0,0]
[{"$f":"RICHIESTA!C192","v":51},"UNITA IMMOBILIARE 51",null,1,{"$f":"INDEX(RICHIESTA!$X$142:$X$241,MATCH(A79,RICHIESTA!$C$142:$C$241,0))","v":0},0,0,0,0,{"$f":"INDEX(RICHIESTA!$I$142:$I$241,MATCH(A79,RICHIESTA!$C$142:$C$241,0))","v":"Privata"},null,null,null,null,{"$f":"$D79*(INDEX(RICHIESTA!$BG$142:$BG$241,MATCH($A79,RICHIESTA!$C$142:$C$241,0))\n+$E79*IF($A$1=\"N\",RICHIESTA!$O$128-RICHIESTA!$O$109,0))","v":0},{"$f":"$D79*(INDEX(RICHIESTA!$BA$142:$BA$241,MATCH($A79,RICHIESTA!$C$142:$C$241,0))\n+IF($A$1=\"N\",INDEX(RICHIESTA!$AU$142:$AU$241,MATCH($A79,RICHIESTA!$C$142:$C$241,0))/MAX(RICHIESTA!$AU$140,10^-9)*(RICHIESTA!$AC$128-RICHIESTA!$AC$109),0))","v":0},0,{"$f":"$D79*(INDEX(RICHIESTA!$BC$142:$BC$241,MATCH($A79,RICHIESTA!$C$142:$C$241,0))\n+IF($A$1=\"N\",INDEX(RICHIESTA!$BB$142:$BB$241,MATCH($A79,RICHIESTA!$C$142:$C$241,0)),0))","v":0},null,0,0,0,0]
[{"$f":"RICHIESTA!C193","v":52},"UNITA IMMOBILIARE 52",null,1,{"$f":"INDEX(RICHIESTA!$X$142:$X$241,MATCH(A80,RICHIESTA!$C$142:$C$241,0))","v":0},0,0,0,0,{"$f":"INDEX(RICHIESTA!$I$142:$I$241,MATCH(A80,RICHIESTA!$C$142:$C$241,0))","v":"Privata"},null,null,null,null,{"$f":"$D80*(INDEX(RICHIESTA!$BG$142:$BG$241,MATCH($A80,RICHIESTA!$C$142:$C$241,0))\n+$E80*IF($A$1=\"N\",RICHIESTA!$O$128-RICHIESTA!$O$109,0))","v":0},{"$f":"$D80*(INDEX(RICHIESTA!$BA$142:$BA$241,MATCH($A80,RICHIESTA!$C$142:$C$241,0))\n+IF($A$1=\"N\",INDEX(RICHIESTA!$AU$142:$AU$241,MATCH($A80,RICHIESTA!$C$142:$C$241,0))/MAX(RICHIESTA!$AU$140,10^-9)*(RICHIESTA!$AC$128-RICHIESTA!$AC$109),0))","v":0},0,{"$f":"$D80*(INDEX(RICHIESTA!$BC$142:$BC$241,MATCH($A80,RICHIESTA!$C$142:$C$241,0))\n+IF($A$1=\"N\",INDEX(RICHIESTA!$BB$142:$BB$241,MATCH($A80,RICHIESTA!$C$142:$C$241,0)),0))","v":0},null,0,0,0,0]
[{"$f":"RICHIESTA!C194","v":53},"UNITA IMMOBILIARE 53",null,1,{"$f":"INDEX(RICHIESTA!$X$142:$X$241,MATCH(A81,RICHIESTA!$C$142:$C$241,0))","v":0},0,0,0,0,{"$f":"INDEX(RICHIESTA!$I$142:$I$241,MATCH(A81,RICHIESTA!$C$142:$C$241,0))","v":"Privata"},null,null,null,null,{"$f":"$D81*(INDEX(RICHIESTA!$BG$142:$BG$241,MATCH($A81,RICHIESTA!$C$142:$C$241,0))\n+$E81*IF($A$1=\"N\",RICHIESTA!$O$128-RICHIESTA!$O$109,0))","v":0},{"$f":"$D81*(INDEX(RICHIESTA!$BA$142:$BA$241,MATCH($A81,RICHIESTA!$C$142:$C$241,0))\n+IF($A$1=\"N\",INDEX(RICHIESTA!$AU$142:$AU$241,MATCH($A81,RICHIESTA!$C$142:$C$241,0))/MAX(RICHIESTA!$AU$140,10^-9)*(RICHIESTA!$AC$128-RICHIESTA!$AC$109),0))","v":0},0,{"$f":"$D81*(INDEX(RICHIESTA!$BC$142:$BC$241,MATCH($A81,RICHIESTA!$C$142:$C$241,0))\n+IF($A$1=\"N\",INDEX(RICHIESTA!$BB$142:$BB$241,MATCH($A81,RICHIESTA!$C$142:$C$241,0)),0))","v":0},null,0,0,0,0]
[{"$f":"RICHIESTA!C195","v":54},"UNITA IMMOBILIARE 54",null,1,{"$f":"INDEX(RICHIESTA!$X$142:$X$241,MATCH(A82,RICHIESTA!$C$142:$C$241,0))","v":0},0,0,0,0,{"$f":"INDEX(RICHIESTA!$I$142:$I$241,MATCH(A82,RICHIESTA!$C$142:$C$241,0))","v":"Privata"},null,null,null,null,{"$f":"$D82*(INDEX(RICHIESTA!$BG$142:$BG$241,MATCH($A82,RICHIESTA!$C$142:$C$241,0))\n+$E82*IF($A$1=\"N\",RICHIESTA!$O$128-RICHIESTA!$O$109,0))","v":0},{"$f":"$D82*(INDEX(RICHIESTA!$BA$142:$BA$241,MATCH($A82,RICHIESTA!$C$142:$C$241,0))\n+IF($A$1=\"N\",INDEX(RICHIESTA!$AU$142:$AU$241,MATCH($A82,RICHIESTA!$C$142:$C$241,0))/MAX(RICHIESTA!$AU$140,10^-9)*(RICHIESTA!$AC$128-RICHIESTA!$AC$109),0))","v":0},0,{"$f":"$D82*(INDEX(RICHIESTA!$BC$142:$BC$241,MATCH($A82,RICHIESTA!$C$142:$C$241,0))\n+IF($A$1=\"N\",INDEX(RICHIESTA!$BB$142:$BB$241,MATCH($A82,RICHIESTA!$C$142:$C$241,0)),0))","v":0},null,0,0,0,0]
[{"$f":"RICHIESTA!C196","v":55},"UNITA IMMOBILIARE 55",null,1,{"$f":"INDEX(RICHIESTA!$X$142:$X$241,MATCH(A83,RICHIESTA!$C$142:$C$241,0))","v":0},0,0,0,0,{"$f":"INDEX(RICHIESTA!$I$142:$I$241,MATCH(A83,RICHIESTA!$C$142:$C$241,0))","v":"Privata"},null,null,null,null,{"$f":"$D83*(INDEX(RICHIESTA!$BG$142:$BG$241,MATCH($A83,RICHIESTA!$C$142:$C$241,0))\n+$E83*IF($A$1=\"N\",RICHIESTA!$O$128-RICHIESTA!$O$109,0))","v":0},{"$f":"$D83*(INDEX(RICHIESTA!$BA$142:$BA$241,MATCH($A83,RICHIESTA!$C$142:$C$241,0))\n+IF($A$1=\"N\",INDEX(RICHIESTA!$AU$142:$AU$241,MATCH($A83,RICHIESTA!$C$142:$C$241,0))/MAX(RICHIESTA!$AU$140,10^-9)*(RICHIESTA!$AC$128-RICHIESTA!$AC$109),0))","v":0},0,{"$f":"$D83*(INDEX(RICHIESTA!$BC$142:$BC$241,MATCH($A83,RICHIESTA!$C$142:$C$241,0))\n+IF($A$1=\"N\",INDEX(RICHIESTA!$BB$142:$BB$241,MATCH($A83,RICHIESTA!$C$142:$C$241,0)),0))","v":0},null,0,0,0,0]
[{"$f":"RICHIESTA!C197","v":56},"UNITA IMMOBILIARE 56",null,1,{"$f":"INDEX(RICHIESTA!$X$142:$X$241,MATCH(A84,RICHIESTA!$C$142:$C$241,0))","v":0},0,0,0,0,{"$f":"INDEX(RICHIESTA!$I$142:$I$241,MATCH(A84,RICHIESTA!$C$142:$C$241,0))","v":"Privata"},null,null,null,null,{"$f":"$D84*(INDEX(RICHIESTA!$BG$142:$BG$241,MATCH($A84,RICHIESTA!$C$142:$C$241,0))\n+$E84*IF($A$1=\"N\",RICHIESTA!$O$128-RICHIESTA!$O$109,0))","v":0},{"$f":"$D84*(INDEX(RICHIESTA!$BA$142:$BA$241,MATCH($A84,RICHIESTA!$C$142:$C$241,0))\n+IF($A$1=\"N\",INDEX(RICHIESTA!$AU$142:$AU$241,MATCH($A84,RICHIESTA!$C$142:$C$241,0))/MAX(RICHIESTA!$AU$140,10^-9)*(RICHIESTA!$AC$128-RICHIESTA!$AC$109),0))","v":0},0,{"$f":"$D84*(INDEX(RICHIESTA!$BC$142:$BC$241,MATCH($A84,RICHIESTA!$C$142:$C$241,0))\n+IF($A$1=\"N\",INDEX(RICHIESTA!$BB$142:$BB$241,MATCH($A84,RICHIESTA!$C$142:$C$241,0)),0))","v":0},null,0,0,0,0]
[{"$f":"RICHIESTA!C198","v":57},"UNITA IMMOBILIARE 57",null,1,{"$f":"INDEX(RICHIESTA!$X$142:$X$241,MATCH(A85,RICHIESTA!$C$142:$C$241,0))","v":0},0,0,0,0,{"$f":"INDEX(RICHIESTA!$I$142:$I$241,MATCH(A85,RICHIESTA!$C$142:$C$241,0))","v":"Privata"},null,null,null,null,{"$f":"$D85*(INDEX(RICHIESTA!$BG$142:$BG$241,MATCH($A85,RICHIESTA!$C$142:$C$241,0))\n+$E85*IF($A$1=\"N\",RICHIESTA!$O$128-RICHIESTA!$O$109,0))","v":0},{"$f":"$D85*(INDEX(RICHIESTA!$BA$142:$BA$241,MATCH($A85,RICHIESTA!$C$142:$C$241,0))\n+IF($A$1=\"N\",INDEX(RICHIESTA!$AU$142:$AU$241,MATCH($A85,RICHIESTA!$C$142:$C$241,0))/MAX(RICHIESTA!$AU$140,10^-9)*(RICHIESTA!$AC$128-RICHIESTA!$AC$109),0))","v":0},0,{"$f":"$D85*(INDEX(RICHIESTA!$BC$142:$BC$241,MATCH($A85,RICHIESTA!$C$142:$C$241,0))\n+IF($A$1=\"N\",INDEX(RICHIESTA!$BB$142:$BB$241,MATCH($A85,RICHIESTA!$C$142:$C$241,0)),0))","v":0},null,0,0,0,0]
[{"$f":"RICHIESTA!C199","v":58},"UNITA IMMOBILIARE 58",null,1,{"$f":"INDEX(RICHIESTA!$X$142:$X$241,MATCH(A86,RICHIESTA!$C$142:$C$241,0))","v":0},0,0,0,0,{"$f":"INDEX(RICHIESTA!$I$142:$I$241,MATCH(A86,RICHIESTA!$C$142:$C$241,0))","v":"Privata"},null,null,null,null,{"$f":"$D86*(INDEX(RICHIESTA!$BG$142:$BG$241,MATCH($A86,RICHIESTA!$C$142:$C$241,0))\n+$E86*IF($A$1=\"N\",RICHIESTA!$O$128-RICHIESTA!$O$109,0))","v":0},{"$f":"$D86*(INDEX(RICHIESTA!$BA$142:$BA$241,MATCH($A86,RICHIESTA!$C$142:$C$241,0))\n+IF($A$1=\"N\",INDEX(RICHIESTA!$AU$142:$AU$241,MATCH($A86,RICHIESTA!$C$142:$C$241,0))/MAX(RICHIESTA!$AU$140,10^-9)*(RICHIESTA!$AC$128-RICHIESTA!$AC$109),0))","v":0},0,{"$f":"$D86*(INDEX(RICHIESTA!$BC$142:$BC$241,MATCH($A86,RICHIESTA!$C$142:$C$241,0))\n+IF($A$1=\"N\",INDEX(RICHIESTA!$BB$142:$BB$241,MATCH($A86,RICHIESTA!$C$142:$C$241,0)),0))","v":0},null,0,0,0,0]
[{"$f":"RICHIESTA!C200","v":59},"UNITA IMMOBILIARE 59",null,1,{"$f":"INDEX(RICHIESTA!$X$142:$X$241,MATCH(A87,RICHIESTA!$C$142:$C$241,0))","v":0},0,0,0,0,{"$f":"INDEX(RICHIESTA!$I$142:$I$241,MATCH(A87,RICHIESTA!$C$142:$C$241,0))","v":"Privata"},null,null,null,null,{"$f":"$D87*(INDEX(RICHIESTA!$BG$142:$BG$241,MATCH($A87,RICHIESTA!$C$142:$C$241,0))\n+$E87*IF($A$1=\"N\",RICHIESTA!$O$128-RICHIESTA!$O$109,0))","v":0},{"$f":"$D87*(INDEX(RICHIESTA!$BA$142:$BA$241,MATCH($A87,RICHIESTA!$C$142:$C$241,0))\n+IF($A$1=\"N\",INDEX(RICHIESTA!$AU$142:$AU$241,MATCH($A87,RICHIESTA!$C$142:$C$241,0))/MAX(RICHIESTA!$AU$140,10^-9)*(RICHIESTA!$AC$128-RICHIESTA!$AC$109),0))","v":0},0,{"$f":"$D87*(INDEX(RICHIESTA!$BC$142:$BC$241,MATCH($A87,RICHIESTA!$C$142:$C$241,0))\n+IF($A$1=\"N\",INDEX(RICHIESTA!$BB$142:$BB$241,MATCH($A87,RICHIESTA!$C$142:$C$241,0)),0))","v":0},null,0,0,0,0]
[{"$f":"RICHIESTA!C201","v":60},"UNITA IMMOBILIARE 60",null,1,{"$f":"INDEX(RICHIESTA!$X$142:$X$241,MATCH(A88,RICHIESTA!$C$142:$C$241,0))","v":0},0,0,0,0,{"$f":"INDEX(RICHIESTA!$I$142:$I$241,MATCH(A88,RICHIESTA!$C$142:$C$241,0))","v":"Privata"},null,null,null,null,{"$f":"$D88*(INDEX(RICHIESTA!$BG$142:$BG$241,MATCH($A88,RICHIESTA!$C$142:$C$241,0))\n+$E88*IF($A$1=\"N\",RICHIESTA!$O$128-RICHIESTA!$O$109,0))","v":0},{"$f":"$D88*(INDEX(RICHIESTA!$BA$142:$BA$241,MATCH($A88,RICHIESTA!$C$142:$C$241,0))\n+IF($A$1=\"N\",INDEX(RICHIESTA!$AU$142:$AU$241,MATCH($A88,RICHIESTA!$C$142:$C$241,0))/MAX(RICHIESTA!$AU$140,10^-9)*(RICHIESTA!$AC$128-RICHIESTA!$AC$109),0))","v":0},0,{"$f":"$D88*(INDEX(RICHIESTA!$BC$142:$BC$241,MATCH($A88,RICHIESTA!$C$142:$C$241,0))\n+IF($A$1=\"N\",INDEX(RICHIESTA!$BB$142:$BB$241,MATCH($A88,RICHIESTA!$C$142:$C$241,0)),0))","v":0},null,0,0,0,0]
[{"$f":"RICHIESTA!C202","v":61},"UNITA IMMOBILIARE 61",null,1,{"$f":"INDEX(RICHIESTA!$X$142:$X$241,MATCH(A89,RICHIESTA!$C$142:$C$241,0))","v":0},0,0,0,0,{"$f":"INDEX(RICHIESTA!$I$142:$I$241,MATCH(A89,RICHIESTA!$C$142:$C$241,0))","v":"Privata"},null,null,null,null,{"$f":"$D89*(INDEX(RICHIESTA!$BG$142:$BG$241,MATCH($A89,RICHIESTA!$C$142:$C$241,0))\n+$E89*IF($A$1=\"N\",RICHIESTA!$O$128-RICHIESTA!$O$109,0))","v":0},{"$f":"$D89*(INDEX(RICHIESTA!$BA$142:$BA$241,MATCH($A89,RICHIESTA!$C$142:$C$241,0))\n+IF($A$1=\"N\",INDEX(RICHIESTA!$AU$142:$AU$241,MATCH($A89,RICHIESTA!$C$142:$C$241,0))/MAX(RICHIESTA!$AU$140,10^-9)*(RICHIESTA!$AC$128-RICHIESTA!$AC$109),0))","v":0},0,{"$f":"$D89*(INDEX(RICHIESTA!$BC$142:$BC$241,MATCH($A89,RICHIESTA!$C$142:$C$241,0))\n+IF($A$1=\"N\",INDEX(RICHIESTA!$BB$142:$BB$241,MATCH($A89,RICHIESTA!$C$142:$C$241,0)),0))","v":0},null,0,0,0,0]
[{"$f":"RICHIESTA!C203","v":62},"UNITA IMMOBILIARE 62",null,1,{"$f":"INDEX(RICHIESTA!$X$142:$X$241,MATCH(A90,RICHIESTA!$C$142:$C$241,0))","v":0},0,0,0,0,{"$f":"INDEX(RICHIESTA!$I$142:$I$241,MATCH(A90,RICHIESTA!$C$142:$C$241,0))","v":"Privata"},null,null,null,null,{"$f":"$D90*(INDEX(RICHIESTA!$BG$142:$BG$241,MATCH($A90,RICHIESTA!$C$142:$C$241,0))\n+$E90*IF($A$1=\"N\",RICHIESTA!$O$128-RICHIESTA!$O$109,0))","v":0},{"$f":"$D90*(INDEX(RICHIESTA!$BA$142:$BA$241,MATCH($A90,RICHIESTA!$C$142:$C$241,0))\n+IF($A$1=\"N\",INDEX(RICHIESTA!$AU$142:$AU$241,MATCH($A90,RICHIESTA!$C$142:$C$241,0))/MAX(RICHIESTA!$AU$140,10^-9)*(RICHIESTA!$AC$128-RICHIESTA!$AC$109),0))","v":0},0,{"$f":"$D90*(INDEX(RICHIESTA!$BC$142:$BC$241,MATCH($A90,RICHIESTA!$C$142:$C$241,0))\n+IF($A$1=\"N\",INDEX(RICHIESTA!$BB$142:$BB$241,MATCH($A90,RICHIESTA!$C$142:$C$241,0)),0))","v":0},null,0,0,0,0]
[{"$f":"RICHIESTA!C204","v":63},"UNITA IMMOBILIARE 63",null,1,{"$f":"INDEX(RICHIESTA!$X$142:$X$241,MATCH(A91,RICHIESTA!$C$142:$C$241,0))","v":0},0,0,0,0,{"$f":"INDEX(RICHIESTA!$I$142:$I$241,MATCH(A91,RICHIESTA!$C$142:$C$241,0))","v":"Privata"},null,null,null,null,{"$f":"$D91*(INDEX(RICHIESTA!$BG$142:$BG$241,MATCH($A91,RICHIESTA!$C$142:$C$241,0))\n+$E91*IF($A$1=\"N\",RICHIESTA!$O$128-RICHIESTA!$O$109,0))","v":0},{"$f":"$D91*(INDEX(RICHIESTA!$BA$142:$BA$241,MATCH($A91,RICHIESTA!$C$142:$C$241,0))\n+IF($A$1=\"N\",INDEX(RICHIESTA!$AU$142:$AU$241,MATCH($A91,RICHIESTA!$C$142:$C$241,0))/MAX(RICHIESTA!$AU$140,10^-9)*(RICHIESTA!$AC$128-RICHIESTA!$AC$109),0))","v":0},0,{"$f":"$D91*(INDEX(RICHIESTA!$BC$142:$BC$241,MATCH($A91,RICHIESTA!$C$142:$C$241,0))\n+IF($A$1=\"N\",INDEX(RICHIESTA!$BB$142:$BB$241,MATCH($A91,RICHIESTA!$C$142:$C$241,0)),0))","v":0},null,0,0,0,0]
[{"$f":"RICHIESTA!C205","v":64},"UNITA IMMOBILIARE 64",null,1,{"$f":"INDEX(RICHIESTA!$X$142:$X$241,MATCH(A92,RICHIESTA!$C$142:$C$241,0))","v":0},0,0,0,0,{"$f":"INDEX(RICHIESTA!$I$142:$I$241,MATCH(A92,RICHIESTA!$C$142:$C$241,0))","v":"Privata"},null,null,null,null,{"$f":"$D92*(INDEX(RICHIESTA!$BG$142:$BG$241,MATCH($A92,RICHIESTA!$C$142:$C$241,0))\n+$E92*IF($A$1=\"N\",RICHIESTA!$O$128-RICHIESTA!$O$109,0))","v":0},{"$f":"$D92*(INDEX(RICHIESTA!$BA$142:$BA$241,MATCH($A92,RICHIESTA!$C$142:$C$241,0))\n+IF($A$1=\"N\",INDEX(RICHIESTA!$AU$142:$AU$241,MATCH($A92,RICHIESTA!$C$142:$C$241,0))/MAX(RICHIESTA!$AU$140,10^-9)*(RICHIESTA!$AC$128-RICHIESTA!$AC$109),0))","v":0},0,{"$f":"$D92*(INDEX(RICHIESTA!$BC$142:$BC$241,MATCH($A92,RICHIESTA!$C$142:$C$241,0))\n+IF($A$1=\"N\",INDEX(RICHIESTA!$BB$142:$BB$241,MATCH($A92,RICHIESTA!$C$142:$C$241,0)),0))","v":0},null,0,0,0,0]
[{"$f":"RICHIESTA!C206","v":65},"UNITA IMMOBILIARE 65",null,1,{"$f":"INDEX(RICHIESTA!$X$142:$X$241,MATCH(A93,RICHIESTA!$C$142:$C$241,0))","v":0},0,0,0,0,{"$f":"INDEX(RICHIESTA!$I$142:$I$241,MATCH(A93,RICHIESTA!$C$142:$C$241,0))","v":"Privata"},null,null,null,null,{"$f":"$D93*(INDEX(RICHIESTA!$BG$142:$BG$241,MATCH($A93,RICHIESTA!$C$142:$C$241,0))\n+$E93*IF($A$1=\"N\",RICHIESTA!$O$128-RICHIESTA!$O$109,0))","v":0},{"$f":"$D93*(INDEX(RICHIESTA!$BA$142:$BA$241,MATCH($A93,RICHIESTA!$C$142:$C$241,0))\n+IF($A$1=\"N\",INDEX(RICHIESTA!$AU$142:$AU$241,MATCH($A93,RICHIESTA!$C$142:$C$241,0))/MAX(RICHIESTA!$AU$140,10^-9)*(RICHIESTA!$AC$128-RICHIESTA!$AC$109),0))","v":0},0,{"$f":"$D93*(INDEX(RICHIESTA!$BC$142:$BC$241,MATCH($A93,RICHIESTA!$C$142:$C$241,0))\n+IF($A$1=\"N\",INDEX(RICHIESTA!$BB$142:$BB$241,MATCH($A93,RICHIESTA!$C$142:$C$241,0)),0))","v":0},null,0,0,0,0]
[{"$f":"RICHIESTA!C207","v":66},{"$f":"\"UNITA IMMOBILIARE \"&A94","v":"UNITA IMMOBILIARE 66"},null,1,{"$f":"INDEX(RICHIESTA!$X$142:$X$241,MATCH(A94,RICHIESTA!$C$142:$C$241,0))","v":0},{"$f":"T94","v":0},{"$f":"U94","v":0},{"$f":"V94","v":0},{"$f":"W94","v":0},{"$f":"INDEX(RICHIESTA!$I$142:$I$241,MATCH(A94,RICHIESTA!$C$142:$C$241,0))","v":"Privata"},null,null,null,null,{"$f":"$D94*(INDEX(RICHIESTA!$BG$142:$BG$241,MATCH($A94,RICHIESTA!$C$142:$C$241,0))\n+$E94*IF($A$1=\"N\",RICHIESTA!$O$128-RICHIESTA!$O$109,0))","v":0},{"$f":"$D94*(INDEX(RICHIESTA!$BA$142:$BA$241,MATCH($A94,RICHIESTA!$C$142:$C$241,0))\n+IF($A$1=\"N\",INDEX(RICHIESTA!$AU$142:$AU$241,MATCH($A94,RICHIESTA!$C$142:$C$241,0))/MAX(RICHIESTA!$AU$140,10^-9)*(RICHIESTA!$AC$128-RICHIESTA!$AC$109),0))","v":0},{"$f":"O94-R94-P94","v":0},{"$f":"$D94*(INDEX(RICHIESTA!$BC$142:$BC$241,MATCH($A94,RICHIESTA!$C$142:$C$241,0))\n+IF($A$1=\"N\",INDEX(RICHIESTA!$BB$142:$BB$241,MATCH($A94,RICHIESTA!$C$142:$C$241,0)),0))","v":0},null,{"$f":"ROUND(O94,2)","v":0},{"$f":"ROUND(P94,2)","v":0},{"$f":"T94-W94-U94","v":0},{"$f":"ROUND(R94,2)","v":0}]
[{"$f":"RICHIESTA!C208","v":67},"UNITA IMMOBILIARE 67",null,1,{"$f":"INDEX(RICHIESTA!$X$142:$X$241,MATCH(A95,RICHIESTA!$C$142:$C$241,0))","v":0},0,0,0,0,{"$f":"INDEX(RICHIESTA!$I$142:$I$241,MATCH(A95,RICHIESTA!$C$142:$C$241,0))","v":"Privata"},null,null,null,null,{"$f":"$D95*(INDEX(RICHIESTA!$BG$142:$BG$241,MATCH($A95,RICHIESTA!$C$142:$C$241,0))\n+$E95*IF($A$1=\"N\",RICHIESTA!$O$128-RICHIESTA!$O$109,0))","v":0},{"$f":"$D95*(INDEX(RICHIESTA!$BA$142:$BA$241,MATCH($A95,RICHIESTA!$C$142:$C$241,0))\n+IF($A$1=\"N\",INDEX(RICHIESTA!$AU$142:$AU$241,MATCH($A95,RICHIESTA!$C$142:$C$241,0))/MAX(RICHIESTA!$AU$140,10^-9)*(RICHIESTA!$AC$128-RICHIESTA!$AC$109),0))","v":0},0,{"$f":"$D95*(INDEX(RICHIESTA!$BC$142:$BC$241,MATCH($A95,RICHIESTA!$C$142:$C$241,0))\n+IF($A$1=\"N\",INDEX(RICHIESTA!$BB$142:$BB$241,MATCH($A95,RICHIESTA!$C$142:$C$241,0)),0))","v":0},null,0,0,0,0]
[{"$f":"RICHIESTA!C209","v":68},"UNITA IMMOBILIARE 68",null,1,{"$f":"INDEX(RICHIESTA!$X$142:$X$241,MATCH(A96,RICHIESTA!$C$142:$C$241,0))","v":0},0,0,0,0,{"$f":"INDEX(RICHIESTA!$I$142:$I$241,MATCH(A96,RICHIESTA!$C$142:$C$241,0))","v":"Privata"},null,null,null,null,{"$f":"$D96*(INDEX(RICHIESTA!$BG$142:$BG$241,MATCH($A96,RICHIESTA!$C$142:$C$241,0))\n+$E96*IF($A$1=\"N\",RICHIESTA!$O$128-RICHIESTA!$O$109,0))","v":0},{"$f":"$D96*(INDEX(RICHIESTA!$BA$142:$BA$241,MATCH($A96,RICHIESTA!$C$142:$C$241,0))\n+IF($A$1=\"N\",INDEX(RICHIESTA!$AU$142:$AU$241,MATCH($A96,RICHIESTA!$C$142:$C$241,0))/MAX(RICHIESTA!$AU$140,10^-9)*(RICHIESTA!$AC$128-RICHIESTA!$AC$109),0))","v":0},0,{"$f":"$D96*(INDEX(RICHIESTA!$BC$142:$BC$241,MATCH($A96,RICHIESTA!$C$142:$C$241,0))\n+IF($A$1=\"N\",INDEX(RICHIESTA!$BB$142:$BB$241,MATCH($A96,RICHIESTA!$C$142:$C$241,0)),0))","v":0},null,0,0,0,0]
[{"$f":"RICHIESTA!C210","v":69},"UNITA IMMOBILIARE 69",null,1,{"$f":"INDEX(RICHIESTA!$X$142:$X$241,MATCH(A97,RICHIESTA!$C$142:$C$241,0))","v":0},0,0,0,0,{"$f":"INDEX(RICHIESTA!$I$142:$I$241,MATCH(A97,RICHIESTA!$C$142:$C$241,0))","v":"Privata"},null,null,null,null,{"$f":"$D97*(INDEX(RICHIESTA!$BG$142:$BG$241,MATCH($A97,RICHIESTA!$C$142:$C$241,0))\n+$E97*IF($A$1=\"N\",RICHIESTA!$O$128-RICHIESTA!$O$109,0))","v":0},{"$f":"$D97*(INDEX(RICHIESTA!$BA$142:$BA$241,MATCH($A97,RICHIESTA!$C$142:$C$241,0))\n+IF($A$1=\"N\",INDEX(RICHIESTA!$AU$142:$AU$241,MATCH($A97,RICHIESTA!$C$142:$C$241,0))/MAX(RICHIESTA!$AU$140,10^-9)*(RICHIESTA!$AC$128-RICHIESTA!$AC$109),0))","v":0},0,{"$f":"$D97*(INDEX(RICHIESTA!$BC$142:$BC$241,MATCH($A97,RICHIESTA!$C$142:$C$241,0))\n+IF($A$1=\"N\",INDEX(RICHIESTA!$BB$142:$BB$241,MATCH($A97,RICHIESTA!$C$142:$C$241,0)),0))","v":0},null,0,0,0,0]
[{"$f":"RICHIESTA!C211","v":70},"UNITA IMMOBILIARE 70",null,1,{"$f":"INDEX(RICHIESTA!$X$142:$X$241,MATCH(A98,RICHIESTA!$C$142:$C$241,0))","v":0},0,0,0,0,{"$f":"INDEX(RICHIESTA!$I$142:$I$241,MATCH(A98,RICHIESTA!$C$142:$C$241,0))","v":"Privata"},null,null,null,null,{"$f":"$D98*(INDEX(RICHIESTA!$BG$142:$BG$241,MATCH($A98,RICHIESTA!$C$142:$C$241,0))\n+$E98*IF($A$1=\"N\",RICHIESTA!$O$128-RICHIESTA!$O$109,0))","v":0},{"$f":"$D98*(INDEX(RICHIESTA!$BA$142:$BA$241,MATCH($A98,RICHIESTA!$C$142:$C$241,0))\n+IF($A$1=\"N\",INDEX(RICHIESTA!$AU$142:$AU$241,MATCH($A98,RICHIESTA!$C$142:$C$241,0))/MAX(RICHIESTA!$AU$140,10^-9)*(RICHIESTA!$AC$128-RICHIESTA!$AC$109),0))","v":0},0,{"$f":"$D98*(INDEX(RICHIESTA!$BC$142:$BC$241,MATCH($A98,RICHIESTA!$C$142:$C$241,0))\n+IF($A$1=\"N\",INDEX(RICHIESTA!$BB$142:$BB$241,MATCH($A98,RICHIESTA!$C$142:$C$241,0)),0))","v":0},null,0,0,0,0]
[{"$f":"RICHIESTA!C212","v":71},"UNITA IMMOBILIARE 71",null,1,{"$f":"INDEX(RICHIESTA!$X$142:$X$241,MATCH(A99,RICHIESTA!$C$142:$C$241,0))","v":0},0,0,0,0,{"$f":"INDEX(RICHIESTA!$I$142:$I$241,MATCH(A99,RICHIESTA!$C$142:$C$241,0))","v":"Privata"},null,null,null,null,{"$f":"$D99*(INDEX(RICHIESTA!$BG$142:$BG$241,MATCH($A99,RICHIESTA!$C$142:$C$241,0))\n+$E99*IF($A$1=\"N\",RICHIESTA!$O$128-RICHIESTA!$O$109,0))","v":0},{"$f":"$D99*(INDEX(RICHIESTA!$BA$142:$BA$241,MATCH($A99,RICHIESTA!$C$142:$C$241,0))\n+IF($A$1=\"N\",INDEX(RICHIESTA!$AU$142:$AU$241,MATCH($A99,RICHIESTA!$C$142:$C$241,0))/MAX(RICHIESTA!$AU$140,10^-9)*(RICHIESTA!$AC$128-RICHIESTA!$AC$109),0))","v":0},0,{"$f":"$D99*(INDEX(RICHIESTA!$BC$142:$BC$241,MATCH($A99,RICHIESTA!$C$142:$C$241,0))\n+IF($A$1=\"N\",INDEX(RICHIESTA!$BB$142:$BB$241,MATCH($A99,RICHIESTA!$C$142:$C$241,0)),0))","v":0},null,0,0,0,0]
[{"$f":"RICHIESTA!C213","v":72},"UNITA IMMOBILIARE 72",null,1,{"$f":"INDEX(RICHIESTA!$X$142:$X$241,MATCH(A100,RICHIESTA!$C$142:$C$241,0))","v":0},0,0,0,0,{"$f":"INDEX(RICHIESTA!$I$142:$I$241,MATCH(A100,RICHIESTA!$C$142:$C$241,0))","v":"Privata"},null,null,null,null,{"$f":"$D100*(INDEX(RICHIESTA!$BG$142:$BG$241,MATCH($A100,RICHIESTA!$C$142:$C$241,0))\n+$E100*IF($A$1=\"N\",RICHIESTA!$O$128-RICHIESTA!$O$109,0))","v":0},{"$f":"$D100*(INDEX(RICHIESTA!$BA$142:$BA$241,MATCH($A100,RICHIESTA!$C$142:$C$241,0))\n+IF($A$1=\"N\",INDEX(RICHIESTA!$AU$142:$AU$241,MATCH($A100,RICHIESTA!$C$142:$C$241,0))/MAX(RICHIESTA!$AU$140,10^-9)*(RICHIESTA!$AC$128-RICHIESTA!$AC$109),0))","v":0},0,{"$f":"$D100*(INDEX(RICHIESTA!$BC$142:$BC$241,MATCH($A100,RICHIESTA!$C$142:$C$241,0))\n+IF($A$1=\"N\",INDEX(RICHIESTA!$BB$142:$BB$241,MATCH($A100,RICHIESTA!$C$142:$C$241,0)),0))","v":0},null,0,0,0,0]
[{"$f":"RICHIESTA!C214","v":73},"UNITA IMMOBILIARE 73",null,1,{"$f":"INDEX(RICHIESTA!$X$142:$X$241,MATCH(A101,RICHIESTA!$C$142:$C$241,0))","v":0},0,0,0,0,{"$f":"INDEX(RICHIESTA!$I$142:$I$241,MATCH(A101,RICHIESTA!$C$142:$C$241,0))","v":"Privata"},null,null,null,null,{"$f":"$D101*(INDEX(RICHIESTA!$BG$142:$BG$241,MATCH($A101,RICHIESTA!$C$142:$C$241,0))\n+$E101*IF($A$1=\"N\",RICHIESTA!$O$128-RICHIESTA!$O$109,0))","v":0},{"$f":"$D101*(INDEX(RICHIESTA!$BA$142:$BA$241,MATCH($A101,RICHIESTA!$C$142:$C$241,0))\n+IF($A$1=\"N\",INDEX(RICHIESTA!$AU$142:$AU$241,MATCH($A101,RICHIESTA!$C$142:$C$241,0))/MAX(RICHIESTA!$AU$140,10^-9)*(RICHIESTA!$AC$128-RICHIESTA!$AC$109),0))","v":0},0,{"$f":"$D101*(INDEX(RICHIESTA!$BC$142:$BC$241,MATCH($A101,RICHIESTA!$C$142:$C$241,0))\n+IF($A$1=\"N\",INDEX(RICHIESTA!$BB$142:$BB$241,MATCH($A101,RICHIESTA!$C$142:$C$241,0)),0))","v":0},null,0,0,0,0]
[{"$f":"RICHIESTA!C215","v":74},"UNITA IMMOBILIARE 74",null,1,{"$f":"INDEX(RICHIESTA!$X$142:$X$241,MATCH(A102,RICHIESTA!$C$142:$C$241,0))","v":0},0,0,0,0,{"$f":"INDEX(RICHIESTA!$I$142:$I$241,MATCH(A102,RICHIESTA!$C$142:$C$241,0))","v":"Privata"},null,null,null,null,{"$f":"$D102*(INDEX(RICHIESTA!$BG$142:$BG$241,MATCH($A102,RICHIESTA!$C$142:$C$241,0))\n+$E102*IF($A$1=\"N\",RICHIESTA!$O$128-RICHIESTA!$O$109,0))","v":0},{"$f":"$D102*(INDEX(RICHIESTA!$BA$142:$BA$241,MATCH($A102,RICHIESTA!$C$142:$C$241,0))\n+IF($A$1=\"N\",INDEX(RICHIESTA!$AU$142:$AU$241,MATCH($A102,RICHIESTA!$C$142:$C$241,0))/MAX(RICHIESTA!$AU$140,10^-9)*(RICHIESTA!$AC$128-RICHIESTA!$AC$109),0))","v":0},0,{"$f":"$D102*(INDEX(RICHIESTA!$BC$142:$BC$241,MATCH($A102,RICHIESTA!$C$142:$C$241,0))\n+IF($A$1=\"N\",INDEX(RICHIESTA!$BB$142:$BB$241,MATCH($A102,RICHIESTA!$C$142:$C$241,0)),0))","v":0},null,0,0,0,0]
[{"$f":"RICHIESTA!C216","v":75},"UNITA IMMOBILIARE 75",null,1,{"$f":"INDEX(RICHIESTA!$X$142:$X$241,MATCH(A103,RICHIESTA!$C$142:$C$241,0))","v":0},0,0,0,0,{"$f":"INDEX(RICHIESTA!$I$142:$I$241,MATCH(A103,RICHIESTA!$C$142:$C$241,0))","v":"Privata"},null,null,null,null,{"$f":"$D103*(INDEX(RICHIESTA!$BG$142:$BG$241,MATCH($A103,RICHIESTA!$C$142:$C$241,0))\n+$E103*IF($A$1=\"N\",RICHIESTA!$O$128-RICHIESTA!$O$109,0))","v":0},{"$f":"$D103*(INDEX(RICHIESTA!$BA$142:$BA$241,MATCH($A103,RICHIESTA!$C$142:$C$241,0))\n+IF($A$1=\"N\",INDEX(RICHIESTA!$AU$142:$AU$241,MATCH($A103,RICHIESTA!$C$142:$C$241,0))/MAX(RICHIESTA!$AU$140,10^-9)*(RICHIESTA!$AC$128-RICHIESTA!$AC$109),0))","v":0},0,{"$f":"$D103*(INDEX(RICHIESTA!$BC$142:$BC$241,MATCH($A103,RICHIESTA!$C$142:$C$241,0))\n+IF($A$1=\"N\",INDEX(RICHIESTA!$BB$142:$BB$241,MATCH($A103,RICHIESTA!$C$142:$C$241,0)),0))","v":0},null,0,0,0,0]
[{"$f":"RICHIESTA!C217","v":76},"UNITA IMMOBILIARE 76",null,1,{"$f":"INDEX(RICHIESTA!$X$142:$X$241,MATCH(A104,RICHIESTA!$C$142:$C$241,0))","v":0},0,0,0,0,{"$f":"INDEX(RICHIESTA!$I$142:$I$241,MATCH(A104,RICHIESTA!$C$142:$C$241,0))","v":"Privata"},null,null,null,null,{"$f":"$D104*(INDEX(RICHIESTA!$BG$142:$BG$241,MATCH($A104,RICHIESTA!$C$142:$C$241,0))\n+$E104*IF($A$1=\"N\",RICHIESTA!$O$128-RICHIESTA!$O$109,0))","v":0},{"$f":"$D104*(INDEX(RICHIESTA!$BA$142:$BA$241,MATCH($A104,RICHIESTA!$C$142:$C$241,0))\n+IF($A$1=\"N\",INDEX(RICHIESTA!$AU$142:$AU$241,MATCH($A104,RICHIESTA!$C$142:$C$241,0))/MAX(RICHIESTA!$AU$140,10^-9)*(RICHIESTA!$AC$128-RICHIESTA!$AC$109),0))","v":0},0,{"$f":"$D104*(INDEX(RICHIESTA!$BC$142:$BC$241,MATCH($A104,RICHIESTA!$C$142:$C$241,0))\n+IF($A$1=\"N\",INDEX(RICHIESTA!$BB$142:$BB$241,MATCH($A104,RICHIESTA!$C$142:$C$241,0)),0))","v":0},null,0,0,0,0]
[{"$f":"RICHIESTA!C218","v":77},"UNITA IMMOBILIARE 77",null,1,{"$f":"INDEX(RICHIESTA!$X$142:$X$241,MATCH(A105,RICHIESTA!$C$142:$C$241,0))","v":0},0,0,0,0,{"$f":"INDEX(RICHIESTA!$I$142:$I$241,MATCH(A105,RICHIESTA!$C$142:$C$241,0))","v":"Privata"},null,null,null,null,{"$f":"$D105*(INDEX(RICHIESTA!$BG$142:$BG$241,MATCH($A105,RICHIESTA!$C$142:$C$241,0))\n+$E105*IF($A$1=\"N\",RICHIESTA!$O$128-RICHIESTA!$O$109,0))","v":0},{"$f":"$D105*(INDEX(RICHIESTA!$BA$142:$BA$241,MATCH($A105,RICHIESTA!$C$142:$C$241,0))\n+IF($A$1=\"N\",INDEX(RICHIESTA!$AU$142:$AU$241,MATCH($A105,RICHIESTA!$C$142:$C$241,0))/MAX(RICHIESTA!$AU$140,10^-9)*(RICHIESTA!$AC$128-RICHIESTA!$AC$109),0))","v":0},0,{"$f":"$D105*(INDEX(RICHIESTA!$BC$142:$BC$241,MATCH($A105,RICHIESTA!$C$142:$C$241,0))\n+IF($A$1=\"N\",INDEX(RICHIESTA!$BB$142:$BB$241,MATCH($A105,RICHIESTA!$C$142:$C$241,0)),0))","v":0},null,0,0,0,0]
[{"$f":"RICHIESTA!C219","v":78},"UNITA IMMOBILIARE 78",null,1,{"$f":"INDEX(RICHIESTA!$X$142:$X$241,MATCH(A106,RICHIESTA!$C$142:$C$241,0))","v":0},0,0,0,0,{"$f":"INDEX(RICHIESTA!$I$142:$I$241,MATCH(A106,RICHIESTA!$C$142:$C$241,0))","v":"Privata"},null,null,null,null,{"$f":"$D106*(INDEX(RICHIESTA!$BG$142:$BG$241,MATCH($A106,RICHIESTA!$C$142:$C$241,0))\n+$E106*IF($A$1=\"N\",RICHIESTA!$O$128-RICHIESTA!$O$109,0))","v":0},{"$f":"$D106*(INDEX(RICHIESTA!$BA$142:$BA$241,MATCH($A106,RICHIESTA!$C$142:$C$241,0))\n+IF($A$1=\"N\",INDEX(RICHIESTA!$AU$142:$AU$241,MATCH($A106,RICHIESTA!$C$142:$C$241,0))/MAX(RICHIESTA!$AU$140,10^-9)*(RICHIESTA!$AC$128-RICHIESTA!$AC$109),0))","v":0},0,{"$f":"$D106*(INDEX(RICHIESTA!$BC$142:$BC$241,MATCH($A106,RICHIESTA!$C$142:$C$241,0))\n+IF($A$1=\"N\",INDEX(RICHIESTA!$BB$142:$BB$241,MATCH($A106,RICHIESTA!$C$142:$C$241,0)),0))","v":0},null,0,0,0,0]
[{"$f":"RICHIESTA!C220","v":79},"UNITA IMMOBILIARE 79",null,1,{"$f":"INDEX(RICHIESTA!$X$142:$X$241,MATCH(A107,RICHIESTA!$C$142:$C$241,0))","v":0},0,0,0,0,{"$f":"INDEX(RICHIESTA!$I$142:$I$241,MATCH(A107,RICHIESTA!$C$142:$C$241,0))","v":"Privata"},null,null,null,null,{"$f":"$D107*(INDEX(RICHIESTA!$BG$142:$BG$241,MATCH($A107,RICHIESTA!$C$142:$C$241,0))\n+$E107*IF($A$1=\"N\",RICHIESTA!$O$128-RICHIESTA!$O$109,0))","v":0},{"$f":"$D107*(INDEX(RICHIESTA!$BA$142:$BA$241,MATCH($A107,RICHIESTA!$C$142:$C$241,0))\n+IF($A$1=\"N\",INDEX(RICHIESTA!$AU$142:$AU$241,MATCH($A107,RICHIESTA!$C$142:$C$241,0))/MAX(RICHIESTA!$AU$140,10^-9)*(RICHIESTA!$AC$128-RICHIESTA!$AC$109),0))","v":0},0,{"$f":"$D107*(INDEX(RICHIESTA!$BC$142:$BC$241,MATCH($A107,RICHIESTA!$C$142:$C$241,0))\n+IF($A$1=\"N\",INDEX(RICHIESTA!$BB$142:$BB$241,MATCH($A107,RICHIESTA!$C$142:$C$241,0)),0))","v":0},null,0,0,0,0]
[{"$f":"RICHIESTA!C221","v":80},"UNITA IMMOBILIARE 80",null,1,{"$f":"INDEX(RICHIESTA!$X$142:$X$241,MATCH(A108,RICHIESTA!$C$142:$C$241,0))","v":0},0,0,0,0,{"$f":"INDEX(RICHIESTA!$I$142:$I$241,MATCH(A108,RICHIESTA!$C$142:$C$241,0))","v":"Privata"},null,null,null,null,{"$f":"$D108*(INDEX(RICHIESTA!$BG$142:$BG$241,MATCH($A108,RICHIESTA!$C$142:$C$241,0))\n+$E108*IF($A$1=\"N\",RICHIESTA!$O$128-RICHIESTA!$O$109,0))","v":0},{"$f":"$D108*(INDEX(RICHIESTA!$BA$142:$BA$241,MATCH($A108,RICHIESTA!$C$142:$C$241,0))\n+IF($A$1=\"N\",INDEX(RICHIESTA!$AU$142:$AU$241,MATCH($A108,RICHIESTA!$C$142:$C$241,0))/MAX(RICHIESTA!$AU$140,10^-9)*(RICHIESTA!$AC$128-RICHIESTA!$AC$109),0))","v":0},0,{"$f":"$D108*(INDEX(RICHIESTA!$BC$142:$BC$241,MATCH($A108,RICHIESTA!$C$142:$C$241,0))\n+IF($A$1=\"N\",INDEX(RICHIESTA!$BB$142:$BB$241,MATCH($A108,RICHIESTA!$C$142:$C$241,0)),0))","v":0},null,0,0,0,0]
[{"$f":"RICHIESTA!C222","v":81},"UNITA IMMOBILIARE 81",null,1,{"$f":"INDEX(RICHIESTA!$X$142:$X$241,MATCH(A109,RICHIESTA!$C$142:$C$241,0))","v":0},0,0,0,0,{"$f":"INDEX(RICHIESTA!$I$142:$I$241,MATCH(A109,RICHIESTA!$C$142:$C$241,0))","v":"Privata"},null,null,null,null,{"$f":"$D109*(INDEX(RICHIESTA!$BG$142:$BG$241,MATCH($A109,RICHIESTA!$C$142:$C$241,0))\n+$E109*IF($A$1=\"N\",RICHIESTA!$O$128-RICHIESTA!$O$109,0))","v":0},{"$f":"$D109*(INDEX(RICHIESTA!$BA$142:$BA$241,MATCH($A109,RICHIESTA!$C$142:$C$241,0))\n+IF($A$1=\"N\",INDEX(RICHIESTA!$AU$142:$AU$241,MATCH($A109,RICHIESTA!$C$142:$C$241,0))/MAX(RICHIESTA!$AU$140,10^-9)*(RICHIESTA!$AC$128-RICHIESTA!$AC$109),0))","v":0},0,{"$f":"$D109*(INDEX(RICHIESTA!$BC$142:$BC$241,MATCH($A109,RICHIESTA!$C$142:$C$241,0))\n+IF($A$1=\"N\",INDEX(RICHIESTA!$BB$142:$BB$241,MATCH($A109,RICHIESTA!$C$142:$C$241,0)),0))","v":0},null,0,0,0,0]
[{"$f":"RICHIESTA!C223","v":82},"UNITA IMMOBILIARE 82",null,1,{"$f":"INDEX(RICHIESTA!$X$142:$X$241,MATCH(A110,RICHIESTA!$C$142:$C$241,0))","v":0},0,0,0,0,{"$f":"INDEX(RICHIESTA!$I$142:$I$241,MATCH(A110,RICHIESTA!$C$142:$C$241,0))","v":"Privata"},null,null,null,null,{"$f":"$D110*(INDEX(RICHIESTA!$BG$142:$BG$241,MATCH($A110,RICHIESTA!$C$142:$C$241,0))\n+$E110*IF($A$1=\"N\",RICHIESTA!$O$128-RICHIESTA!$O$109,0))","v":0},{"$f":"$D110*(INDEX(RICHIESTA!$BA$142:$BA$241,MATCH($A110,RICHIESTA!$C$142:$C$241,0))\n+IF($A$1=\"N\",INDEX(RICHIESTA!$AU$142:$AU$241,MATCH($A110,RICHIESTA!$C$142:$C$241,0))/MAX(RICHIESTA!$AU$140,10^-9)*(RICHIESTA!$AC$128-RICHIESTA!$AC$109),0))","v":0},0,{"$f":"$D110*(INDEX(RICHIESTA!$BC$142:$BC$241,MATCH($A110,RICHIESTA!$C$142:$C$241,0))\n+IF($A$1=\"N\",INDEX(RICHIESTA!$BB$142:$BB$241,MATCH($A110,RICHIESTA!$C$142:$C$241,0)),0))","v":0},null,0,0,0,0]
[{"$f":"RICHIESTA!C224","v":83},"UNITA IMMOBILIARE 83",null,1,{"$f":"INDEX(RICHIESTA!$X$142:$X$241,MATCH(A111,RICHIESTA!$C$142:$C$241,0))","v":0},0,0,0,0,{"$f":"INDEX(RICHIESTA!$I$142:$I$241,MATCH(A111,RICHIESTA!$C$142:$C$241,0))","v":"Privata"},null,null,null,null,{"$f":"$D111*(INDEX(RICHIESTA!$BG$142:$BG$241,MATCH($A111,RICHIESTA!$C$142:$C$241,0))\n+$E111*IF($A$1=\"N\",RICHIESTA!$O$128-RICHIESTA!$O$109,0))","v":0},{"$f":"$D111*(INDEX(RICHIESTA!$BA$142:$BA$241,MATCH($A111,RICHIESTA!$C$142:$C$241,0))\n+IF($A$1=\"N\",INDEX(RICHIESTA!$AU$142:$AU$241,MATCH($A111,RICHIESTA!$C$142:$C$241,0))/MAX(RICHIESTA!$AU$140,10^-9)*(RICHIESTA!$AC$128-RICHIESTA!$AC$109),0))","v":0},0,{"$f":"$D111*(INDEX(RICHIESTA!$BC$142:$BC$241,MATCH($A111,RICHIESTA!$C$142:$C$241,0))\n+IF($A$1=\"N\",INDEX(RICHIESTA!$BB$142:$BB$241,MATCH($A111,RICHIESTA!$C$142:$C$241,0)),0))","v":0},null,0,0,0,0]
[{"$f":"RICHIESTA!C225","v":84},"UNITA IMMOBILIARE 84",null,1,{"$f":"INDEX(RICHIESTA!$X$142:$X$241,MATCH(A112,RICHIESTA!$C$142:$C$241,0))","v":0},0,0,0,0,{"$f":"INDEX(RICHIESTA!$I$142:$I$241,MATCH(A112,RICHIESTA!$C$142:$C$241,0))","v":"Privata"},null,null,null,null,{"$f":"$D112*(INDEX(RICHIESTA!$BG$142:$BG$241,MATCH($A112,RICHIESTA!$C$142:$C$241,0))\n+$E112*IF($A$1=\"N\",RICHIESTA!$O$128-RICHIESTA!$O$109,0))","v":0},{"$f":"$D112*(INDEX(RICHIESTA!$BA$142:$BA$241,MATCH($A112,RICHIESTA!$C$142:$C$241,0))\n+IF($A$1=\"N\",INDEX(RICHIESTA!$AU$142:$AU$241,MATCH($A112,RICHIESTA!$C$142:$C$241,0))/MAX(RICHIESTA!$AU$140,10^-9)*(RICHIESTA!$AC$128-RICHIESTA!$AC$109),0))","v":0},0,{"$f":"$D112*(INDEX(RICHIESTA!$BC$142:$BC$241,MATCH($A112,RICHIESTA!$C$142:$C$241,0))\n+IF($A$1=\"N\",INDEX(RICHIESTA!$BB$142:$BB$241,MATCH($A112,RICHIESTA!$C$142:$C$241,0)),0))","v":0},null,0,0,0,0]
[{"$f":"RICHIESTA!C226","v":85},"UNITA IMMOBILIARE 85",null,1,{"$f":"INDEX(RICHIESTA!$X$142:$X$241,MATCH(A113,RICHIESTA!$C$142:$C$241,0))","v":0},0,0,0,0,{"$f":"INDEX(RICHIESTA!$I$142:$I$241,MATCH(A113,RICHIESTA!$C$142:$C$241,0))","v":"Privata"},null,null,null,null,{"$f":"$D113*(INDEX(RICHIESTA!$BG$142:$BG$241,MATCH($A113,RICHIESTA!$C$142:$C$241,0))\n+$E113*IF($A$1=\"N\",RICHIESTA!$O$128-RICHIESTA!$O$109,0))","v":0},{"$f":"$D113*(INDEX(RICHIESTA!$BA$142:$BA$241,MATCH($A113,RICHIESTA!$C$142:$C$241,0))\n+IF($A$1=\"N\",INDEX(RICHIESTA!$AU$142:$AU$241,MATCH($A113,RICHIESTA!$C$142:$C$241,0))/MAX(RICHIESTA!$AU$140,10^-9)*(RICHIESTA!$AC$128-RICHIESTA!$AC$109),0))","v":0},0,{"$f":"$D113*(INDEX(RICHIESTA!$BC$142:$BC$241,MATCH($A113,RICHIESTA!$C$142:$C$241,0))\n+IF($A$1=\"N\",INDEX(RICHIESTA!$BB$142:$BB$241,MATCH($A113,RICHIESTA!$C$142:$C$241,0)),0))","v":0},null,0,0,0,0]
[{"$f":"RICHIESTA!C227","v":86},"UNITA IMMOBILIARE 86",null,1,{"$f":"INDEX(RICHIESTA!$X$142:$X$241,MATCH(A114,RICHIESTA!$C$142:$C$241,0))","v":0},0,0,0,0,{"$f":"INDEX(RICHIESTA!$I$142:$I$241,MATCH(A114,RICHIESTA!$C$142:$C$241,0))","v":"Privata"},null,null,null,null,{"$f":"$D114*(INDEX(RICHIESTA!$BG$142:$BG$241,MATCH($A114,RICHIESTA!$C$142:$C$241,0))\n+$E114*IF($A$1=\"N\",RICHIESTA!$O$128-RICHIESTA!$O$109,0))","v":0},{"$f":"$D114*(INDEX(RICHIESTA!$BA$142:$BA$241,MATCH($A114,RICHIESTA!$C$142:$C$241,0))\n+IF($A$1=\"N\",INDEX(RICHIESTA!$AU$142:$AU$241,MATCH($A114,RICHIESTA!$C$142:$C$241,0))/MAX(RICHIESTA!$AU$140,10^-9)*(RICHIESTA!$AC$128-RICHIESTA!$AC$109),0))","v":0},0,{"$f":"$D114*(INDEX(RICHIESTA!$BC$142:$BC$241,MATCH($A114,RICHIESTA!$C$142:$C$241,0))\n+IF($A$1=\"N\",INDEX(RICHIESTA!$BB$142:$BB$241,MATCH($A114,RICHIESTA!$C$142:$C$241,0)),0))","v":0},null,0,0,0,0]
[{"$f":"RICHIESTA!C228","v":87},"UNITA IMMOBILIARE 87",null,1,{"$f":"INDEX(RICHIESTA!$X$142:$X$241,MATCH(A115,RICHIESTA!$C$142:$C$241,0))","v":0},0,0,0,0,{"$f":"INDEX(RICHIESTA!$I$142:$I$241,MATCH(A115,RICHIESTA!$C$142:$C$241,0))","v":"Privata"},null,null,null,null,{"$f":"$D115*(INDEX(RICHIESTA!$BG$142:$BG$241,MATCH($A115,RICHIESTA!$C$142:$C$241,0))\n+$E115*IF($A$1=\"N\",RICHIESTA!$O$128-RICHIESTA!$O$109,0))","v":0},{"$f":"$D115*(INDEX(RICHIESTA!$BA$142:$BA$241,MATCH($A115,RICHIESTA!$C$142:$C$241,0))\n+IF($A$1=\"N\",INDEX(RICHIESTA!$AU$142:$AU$241,MATCH($A115,RICHIESTA!$C$142:$C$241,0))/MAX(RICHIESTA!$AU$140,10^-9)*(RICHIESTA!$AC$128-RICHIESTA!$AC$109),0))","v":0},0,{"$f":"$D115*(INDEX(RICHIESTA!$BC$142:$BC$241,MATCH($A115,RICHIESTA!$C$142:$C$241,0))\n+IF($A$1=\"N\",INDEX(RICHIESTA!$BB$142:$BB$241,MATCH($A115,RICHIESTA!$C$142:$C$241,0)),0))","v":0},null,0,0,0,0]
[{"$f":"RICHIESTA!C229","v":88},"UNITA IMMOBILIARE 88",null,1,{"$f":"INDEX(RICHIESTA!$X$142:$X$241,MATCH(A116,RICHIESTA!$C$142:$C$241,0))","v":0},0,0,0,0,{"$f":"INDEX(RICHIESTA!$I$142:$I$241,MATCH(A116,RICHIESTA!$C$142:$C$241,0))","v":"Privata"},null,null,null,null,{"$f":"$D116*(INDEX(RICHIESTA!$BG$142:$BG$241,MATCH($A116,RICHIESTA!$C$142:$C$241,0))\n+$E116*IF($A$1=\"N\",RICHIESTA!$O$128-RICHIESTA!$O$109,0))","v":0},{"$f":"$D116*(INDEX(RICHIESTA!$BA$142:$BA$241,MATCH($A116,RICHIESTA!$C$142:$C$241,0))\n+IF($A$1=\"N\",INDEX(RICHIESTA!$AU$142:$AU$241,MATCH($A116,RICHIESTA!$C$142:$C$241,0))/MAX(RICHIESTA!$AU$140,10^-9)*(RICHIESTA!$AC$128-RICHIESTA!$AC$109),0))","v":0},0,{"$f":"$D116*(INDEX(RICHIESTA!$BC$142:$BC$241,MATCH($A116,RICHIESTA!$C$142:$C$241,0))\n+IF($A$1=\"N\",INDEX(RICHIESTA!$BB$142:$BB$241,MATCH($A116,RICHIESTA!$C$142:$C$241,0)),0))","v":0},null,0,0,0,0]
[{"$f":"RICHIESTA!C230","v":89},"UNITA IMMOBILIARE 89",null,1,{"$f":"INDEX(RICHIESTA!$X$142:$X$241,MATCH(A117,RICHIESTA!$C$142:$C$241,0))","v":0},0,0,0,0,{"$f":"INDEX(RICHIESTA!$I$142:$I$241,MATCH(A117,RICHIESTA!$C$142:$C$241,0))","v":"Privata"},null,null,null,null,{"$f":"$D117*(INDEX(RICHIESTA!$BG$142:$BG$241,MATCH($A117,RICHIESTA!$C$142:$C$241,0))\n+$E117*IF($A$1=\"N\",RICHIESTA!$O$128-RICHIESTA!$O$109,0))","v":0},{"$f":"$D117*(INDEX(RICHIESTA!$BA$142:$BA$241,MATCH($A117,RICHIESTA!$C$142:$C$241,0))\n+IF($A$1=\"N\",INDEX(RICHIESTA!$AU$142:$AU$241,MATCH($A117,RICHIESTA!$C$142:$C$241,0))/MAX(RICHIESTA!$AU$140,10^-9)*(RICHIESTA!$AC$128-RICHIESTA!$AC$109),0))","v":0},0,{"$f":"$D117*(INDEX(RICHIESTA!$BC$142:$BC$241,MATCH($A117,RICHIESTA!$C$142:$C$241,0))\n+IF($A$1=\"N\",INDEX(RICHIESTA!$BB$142:$BB$241,MATCH($A117,RICHIESTA!$C$142:$C$241,0)),0))","v":0},null,0,0,0,0]
[{"$f":"RICHIESTA!C231","v":90},"UNITA IMMOBILIARE 90",null,1,{"$f":"INDEX(RICHIESTA!$X$142:$X$241,MATCH(A118,RICHIESTA!$C$142:$C$241,0))","v":0},0,0,0,0,{"$f":"INDEX(RICHIESTA!$I$142:$I$241,MATCH(A118,RICHIESTA!$C$142:$C$241,0))","v":"Privata"},null,null,null,null,{"$f":"$D118*(INDEX(RICHIESTA!$BG$142:$BG$241,MATCH($A118,RICHIESTA!$C$142:$C$241,0))\n+$E118*IF($A$1=\"N\",RICHIESTA!$O$128-RICHIESTA!$O$109,0))","v":0},{"$f":"$D118*(INDEX(RICHIESTA!$BA$142:$BA$241,MATCH($A118,RICHIESTA!$C$142:$C$241,0))\n+IF($A$1=\"N\",INDEX(RICHIESTA!$AU$142:$AU$241,MATCH($A118,RICHIESTA!$C$142:$C$241,0))/MAX(RICHIESTA!$AU$140,10^-9)*(RICHIESTA!$AC$128-RICHIESTA!$AC$109),0))","v":0},0,{"$f":"$D118*(INDEX(RICHIESTA!$BC$142:$BC$241,MATCH($A118,RICHIESTA!$C$142:$C$241,0))\n+IF($A$1=\"N\",INDEX(RICHIESTA!$BB$142:$BB$241,MATCH($A118,RICHIESTA!$C$142:$C$241,0)),0))","v":0},null,0,0,0,0]
[{"$f":"RICHIESTA!C232","v":91},"UNITA IMMOBILIARE 91",null,1,{"$f":"INDEX(RICHIESTA!$X$142:$X$241,MATCH(A119,RICHIESTA!$C$142:$C$241,0))","v":0},0,0,0,0,{"$f":"INDEX(RICHIESTA!$I$142:$I$241,MATCH(A119,RICHIESTA!$C$142:$C$241,0))","v":"Privata"},null,null,null,null,{"$f":"$D119*(INDEX(RICHIESTA!$BG$142:$BG$241,MATCH($A119,RICHIESTA!$C$142:$C$241,0))\n+$E119*IF($A$1=\"N\",RICHIESTA!$O$128-RICHIESTA!$O$109,0))","v":0},{"$f":"$D119*(INDEX(RICHIESTA!$BA$142:$BA$241,MATCH($A119,RICHIESTA!$C$142:$C$241,0))\n+IF($A$1=\"N\",INDEX(RICHIESTA!$AU$142:$AU$241,MATCH($A119,RICHIESTA!$C$142:$C$241,0))/MAX(RICHIESTA!$AU$140,10^-9)*(RICHIESTA!$AC$128-RICHIESTA!$AC$109),0))","v":0},0,{"$f":"$D119*(INDEX(RICHIESTA!$BC$142:$BC$241,MATCH($A119,RICHIESTA!$C$142:$C$241,0))\n+IF($A$1=\"N\",INDEX(RICHIESTA!$BB$142:$BB$241,MATCH($A119,RICHIESTA!$C$142:$C$241,0)),0))","v":0},null,0,0,0,0]
[{"$f":"RICHIESTA!C233","v":92},"UNITA IMMOBILIARE 92",null,1,{"$f":"INDEX(RICHIESTA!$X$142:$X$241,MATCH(A120,RICHIESTA!$C$142:$C$241,0))","v":0},0,0,0,0,{"$f":"INDEX(RICHIESTA!$I$142:$I$241,MATCH(A120,RICHIESTA!$C$142:$C$241,0))","v":"Privata"},null,null,null,null,{"$f":"$D120*(INDEX(RICHIESTA!$BG$142:$BG$241,MATCH($A120,RICHIESTA!$C$142:$C$241,0))\n+$E120*IF($A$1=\"N\",RICHIESTA!$O$128-RICHIESTA!$O$109,0))","v":0},{"$f":"$D120*(INDEX(RICHIESTA!$BA$142:$BA$241,MATCH($A120,RICHIESTA!$C$142:$C$241,0))\n+IF($A$1=\"N\",INDEX(RICHIESTA!$AU$142:$AU$241,MATCH($A120,RICHIESTA!$C$142:$C$241,0))/MAX(RICHIESTA!$AU$140,10^-9)*(RICHIESTA!$AC$128-RICHIESTA!$AC$109),0))","v":0},0,{"$f":"$D120*(INDEX(RICHIESTA!$BC$142:$BC$241,MATCH($A120,RICHIESTA!$C$142:$C$241,0))\n+IF($A$1=\"N\",INDEX(RICHIESTA!$BB$142:$BB$241,MATCH($A120,RICHIESTA!$C$142:$C$241,0)),0))","v":0},null,0,0,0,0]
[{"$f":"RICHIESTA!C234","v":93},"UNITA IMMOBILIARE 93",null,1,{"$f":"INDEX(RICHIESTA!$X$142:$X$241,MATCH(A121,RICHIESTA!$C$142:$C$241,0))","v":0},0,0,0,0,{"$f":"INDEX(RICHIESTA!$I$142:$I$241,MATCH(A121,RICHIESTA!$C$142:$C$241,0))","v":"Privata"},null,null,null,null,{"$f":"$D121*(INDEX(RICHIESTA!$BG$142:$BG$241,MATCH($A121,RICHIESTA!$C$142:$C$241,0))\n+$E121*IF($A$1=\"N\",RICHIESTA!$O$128-RICHIESTA!$O$109,0))","v":0},{"$f":"$D121*(INDEX(RICHIESTA!$BA$142:$BA$241,MATCH($A121,RICHIESTA!$C$142:$C$241,0))\n+IF($A$1=\"N\",INDEX(RICHIESTA!$AU$142:$AU$241,MATCH($A121,RICHIESTA!$C$142:$C$241,0))/MAX(RICHIESTA!$AU$140,10^-9)*(RICHIESTA!$AC$128-RICHIESTA!$AC$109),0))","v":0},0,{"$f":"$D121*(INDEX(RICHIESTA!$BC$142:$BC$241,MATCH($A121,RICHIESTA!$C$142:$C$241,0))\n+IF($A$1=\"N\",INDEX(RICHIESTA!$BB$142:$BB$241,MATCH($A121,RICHIESTA!$C$142:$C$241,0)),0))","v":0},null,0,0,0,0]
[{"$f":"RICHIESTA!C235","v":94},"UNITA IMMOBILIARE 94",null,1,{"$f":"INDEX(RICHIESTA!$X$142:$X$241,MATCH(A122,RICHIESTA!$C$142:$C$241,0))","v":0},0,0,0,0,{"$f":"INDEX(RICHIESTA!$I$142:$I$241,MATCH(A122,RICHIESTA!$C$142:$C$241,0))","v":"Privata"},null,null,null,null,{"$f":"$D122*(INDEX(RICHIESTA!$BG$142:$BG$241,MATCH($A122,RICHIESTA!$C$142:$C$241,0))\n+$E122*IF($A$1=\"N\",RICHIESTA!$O$128-RICHIESTA!$O$109,0))","v":0},{"$f":"$D122*(INDEX(RICHIESTA!$BA$142:$BA$241,MATCH($A122,RICHIESTA!$C$142:$C$241,0))\n+IF($A$1=\"N\",INDEX(RICHIESTA!$AU$142:$AU$241,MATCH($A122,RICHIESTA!$C$142:$C$241,0))/MAX(RICHIESTA!$AU$140,10^-9)*(RICHIESTA!$AC$128-RICHIESTA!$AC$109),0))","v":0},0,{"$f":"$D122*(INDEX(RICHIESTA!$BC$142:$BC$241,MATCH($A122,RICHIESTA!$C$142:$C$241,0))\n+IF($A$1=\"N\",INDEX(RICHIESTA!$BB$142:$BB$241,MATCH($A122,RICHIESTA!$C$142:$C$241,0)),0))","v":0},null,0,0,0,0]
[{"$f":"RICHIESTA!C236","v":95},"UNITA IMMOBILIARE 95",null,1,{"$f":"INDEX(RICHIESTA!$X$142:$X$241,MATCH(A123,RICHIESTA!$C$142:$C$241,0))","v":0},0,0,0,0,{"$f":"INDEX(RICHIESTA!$I$142:$I$241,MATCH(A123,RICHIESTA!$C$142:$C$241,0))","v":"Privata"},null,null,null,null,{"$f":"$D123*(INDEX(RICHIESTA!$BG$142:$BG$241,MATCH($A123,RICHIESTA!$C$142:$C$241,0))\n+$E123*IF($A$1=\"N\",RICHIESTA!$O$128-RICHIESTA!$O$109,0))","v":0},{"$f":"$D123*(INDEX(RICHIESTA!$BA$142:$BA$241,MATCH($A123,RICHIESTA!$C$142:$C$241,0))\n+IF($A$1=\"N\",INDEX(RICHIESTA!$AU$142:$AU$241,MATCH($A123,RICHIESTA!$C$142:$C$241,0))/MAX(RICHIESTA!$AU$140,10^-9)*(RICHIESTA!$AC$128-RICHIESTA!$AC$109),0))","v":0},0,{"$f":"$D123*(INDEX(RICHIESTA!$BC$142:$BC$241,MATCH($A123,RICHIESTA!$C$142:$C$241,0))\n+IF($A$1=\"N\",INDEX(RICHIESTA!$BB$142:$BB$241,MATCH($A123,RICHIESTA!$C$142:$C$241,0)),0))","v":0},null,0,0,0,0]
[{"$f":"RICHIESTA!C237","v":96},"UNITA IMMOBILIARE 96",null,1,{"$f":"INDEX(RICHIESTA!$X$142:$X$241,MATCH(A124,RICHIESTA!$C$142:$C$241,0))","v":0},0,0,0,0,{"$f":"INDEX(RICHIESTA!$I$142:$I$241,MATCH(A124,RICHIESTA!$C$142:$C$241,0))","v":"Privata"},null,null,null,null,{"$f":"$D124*(INDEX(RICHIESTA!$BG$142:$BG$241,MATCH($A124,RICHIESTA!$C$142:$C$241,0))\n+$E124*IF($A$1=\"N\",RICHIESTA!$O$128-RICHIESTA!$O$109,0))","v":0},{"$f":"$D124*(INDEX(RICHIESTA!$BA$142:$BA$241,MATCH($A124,RICHIESTA!$C$142:$C$241,0))\n+IF($A$1=\"N\",INDEX(RICHIESTA!$AU$142:$AU$241,MATCH($A124,RICHIESTA!$C$142:$C$241,0))/MAX(RICHIESTA!$AU$140,10^-9)*(RICHIESTA!$AC$128-RICHIESTA!$AC$109),0))","v":0},0,{"$f":"$D124*(INDEX(RICHIESTA!$BC$142:$BC$241,MATCH($A124,RICHIESTA!$C$142:$C$241,0))\n+IF($A$1=\"N\",INDEX(RICHIESTA!$BB$142:$BB$241,MATCH($A124,RICHIESTA!$C$142:$C$241,0)),0))","v":0},null,0,0,0,0]
[{"$f":"RICHIESTA!C238","v":97},"UNITA IMMOBILIARE 97",null,1,{"$f":"INDEX(RICHIESTA!$X$142:$X$241,MATCH(A125,RICHIESTA!$C$142:$C$241,0))","v":0},0,0,0,0,{"$f":"INDEX(RICHIESTA!$I$142:$I$241,MATCH(A125,RICHIESTA!$C$142:$C$241,0))","v":"Privata"},null,null,null,null,{"$f":"$D125*(INDEX(RICHIESTA!$BG$142:$BG$241,MATCH($A125,RICHIESTA!$C$142:$C$241,0))\n+$E125*IF($A$1=\"N\",RICHIESTA!$O$128-RICHIESTA!$O$109,0))","v":0},{"$f":"$D125*(INDEX(RICHIESTA!$BA$142:$BA$241,MATCH($A125,RICHIESTA!$C$142:$C$241,0))\n+IF($A$1=\"N\",INDEX(RICHIESTA!$AU$142:$AU$241,MATCH($A125,RICHIESTA!$C$142:$C$241,0))/MAX(RICHIESTA!$AU$140,10^-9)*(RICHIESTA!$AC$128-RICHIESTA!$AC$109),0))","v":0},0,{"$f":"$D125*(INDEX(RICHIESTA!$BC$142:$BC$241,MATCH($A125,RICHIESTA!$C$142:$C$241,0))\n+IF($A$1=\"N\",INDEX(RICHIESTA!$BB$142:$BB$241,MATCH($A125,RICHIESTA!$C$142:$C$241,0)),0))","v":0},null,0,0,0,0]
[{"$f":"RICHIESTA!C239","v":98},"UNITA IMMOBILIARE 98",null,1,{"$f":"INDEX(RICHIESTA!$X$142:$X$241,MATCH(A126,RICHIESTA!$C$142:$C$241,0))","v":0},0,0,0,0,{"$f":"INDEX(RICHIESTA!$I$142:$I$241,MATCH(A126,RICHIESTA!$C$142:$C$241,0))","v":"Privata"},null,null,null,null,{"$f":"$D126*(INDEX(RICHIESTA!$BG$142:$BG$241,MATCH($A126,RICHIESTA!$C$142:$C$241,0))\n+$E126*IF($A$1=\"N\",RICHIESTA!$O$128-RICHIESTA!$O$109,0))","v":0},{"$f":"$D126*(INDEX(RICHIESTA!$BA$142:$BA$241,MATCH($A126,RICHIESTA!$C$142:$C$241,0))\n+IF($A$1=\"N\",INDEX(RICHIESTA!$AU$142:$AU$241,MATCH($A126,RICHIESTA!$C$142:$C$241,0))/MAX(RICHIESTA!$AU$140,10^-9)*(RICHIESTA!$AC$128-RICHIESTA!$AC$109),0))","v":0},0,{"$f":"$D126*(INDEX(RICHIESTA!$BC$142:$BC$241,MATCH($A126,RICHIESTA!$C$142:$C$241,0))\n+IF($A$1=\"N\",INDEX(RICHIESTA!$BB$142:$BB$241,MATCH($A126,RICHIESTA!$C$142:$C$241,0)),0))","v":0},null,0,0,0,0]
[{"$f":"RICHIESTA!C240","v":99},"UNITA IMMOBILIARE 99",null,1,{"$f":"INDEX(RICHIESTA!$X$142:$X$241,MATCH(A127,RICHIESTA!$C$142:$C$241,0))","v":0},0,0,0,0,{"$f":"INDEX(RICHIESTA!$I$142:$I$241,MATCH(A127,RICHIESTA!$C$142:$C$241,0))","v":"Privata"},null,null,null,null,{"$f":"$D127*(INDEX(RICHIESTA!$BG$142:$BG$241,MATCH($A127,RICHIESTA!$C$142:$C$241,0))\n+$E127*IF($A$1=\"N\",RICHIESTA!$O$128-RICHIESTA!$O$109,0))","v":0},{"$f":"$D127*(INDEX(RICHIESTA!$BA$142:$BA$241,MATCH($A127,RICHIESTA!$C$142:$C$241,0))\n+IF($A$1=\"N\",INDEX(RICHIESTA!$AU$142:$AU$241,MATCH($A127,RICHIESTA!$C$142:$C$241,0))/MAX(RICHIESTA!$AU$140,10^-9)*(RICHIESTA!$AC$128-RICHIESTA!$AC$109),0))","v":0},0,{"$f":"$D127*(INDEX(RICHIESTA!$BC$142:$BC$241,MATCH($A127,RICHIESTA!$C$142:$C$241,0))\n+IF($A$1=\"N\",INDEX(RICHIESTA!$BB$142:$BB$241,MATCH($A127,RICHIESTA!$C$142:$C$241,0)),0))","v":0},null,0,0,0,0]
[{"$f":"RICHIESTA!C241","v":100},"UNITA IMMOBILIARE 100",null,1,{"$f":"INDEX(RICHIESTA!$X$142:$X$241,MATCH(A128,RICHIESTA!$C$142:$C$241,0))","v":0},0,0,0,0,{"$f":"INDEX(RICHIESTA!$I$142:$I$241,MATCH(A128,RICHIESTA!$C$142:$C$241,0))","v":"Privata"},null,null,null,null,{"$f":"$D128*(INDEX(RICHIESTA!$BG$142:$BG$241,MATCH($A128,RICHIESTA!$C$142:$C$241,0))\n+$E128*IF($A$1=\"N\",RICHIESTA!$O$128-RICHIESTA!$O$109,0))","v":0},{"$f":"$D128*(INDEX(RICHIESTA!$BA$142:$BA$241,MATCH($A128,RICHIESTA!$C$142:$C$241,0))\n+IF($A$1=\"N\",INDEX(RICHIESTA!$AU$142:$AU$241,MATCH($A128,RICHIESTA!$C$142:$C$241,0))/MAX(RICHIESTA!$AU$140,10^-9)*(RICHIESTA!$AC$128-RICHIESTA!$AC$109),0))","v":0},0,{"$f":"$D128*(INDEX(RICHIESTA!$BC$142:$BC$241,MATCH($A128,RICHIESTA!$C$142:$C$241,0))\n+IF($A$1=\"N\",INDEX(RICHIESTA!$BB$142:$BB$241,MATCH($A128,RICHIESTA!$C$142:$C$241,0)),0))","v":0},null,0,0,0,0]
[null,null,null,null,"TOTALE",{"$f":"SUM(F28:F128)","v":0},{"$f":"SUM(G28:G128)","v":0},{"$f":"SUM(H28:H128)","v":0},{"$f":"SUM(I28:I128)","v":0},null,null,null,null,null,{"$f":"SUM(O28:O128)","v":1.1000000000000001E-23},{"$f":"SUM(P28:P128)","v":0},{"$f":"SUM(Q28:Q128)","v":0},{"$f":"SUM(R28:R128)","v":1.1000000000000001E-23},null,{"$f":"SUM(T28:T128)","v":0},{"$f":"SUM(U28:U128)","v":0},{"$f":"SUM(V28:V128)","v":0},{"$f":"SUM(W28:W128)","v":0}]
[]
[]
[null,"TABELLA B - MUDE"]
[null,"QUADRO RIEPILOGATIVO"]
["% US","TIPOLOGIA DI CONTRIBUTO",null,null,"IMPORTO AMMESSO","QUOTA A CARICO TOTALE (*)","DI CUI COPERTA DA ASSICURAZIONE","DI CUI DA RIMBORSARE","CONTRIBUTO CONCESSO",null,null,null,null,null,null,null,null,null,null,"AMMESSO","ASSICURAZIONE","ACCOLLO","CONTRIBUTO"]
[{"$f":"R135","v":1E-13},"PRIVATI",null,null,{"$f":"T135","v":0},{"$f":"V135","v":0},{"$f":"U135","v":0},{"$f":"W153","v":0},{"$f":"W135","v":0},null,null,null,null,null,null,null,null,{"$f":"RICHIESTA!I137","v":1E-13},"Privata",{"$f":"T28+SUMIF($J$29:$J$128,$S135,T$29:T$129)","v":0},{"$f":"U28+SUMIF(J$29:J$128,$S135,U$29:U$128)","v":0},{"$f":"V28+SUMIF(J$29:J$128,$S135,V$29:V$128)","v":0},{"$f":"W28+SUMIF(J$29:J$128,$S135,I$29:I$128)","v":0}]
[{"$f":"R136","v":0},"ENTI PUBBLICI",null,null,{"$f":"T136","v":0},{"$f":"V136","v":0},{"$f":"U136","v":0},{"$f":"X153","v":0},{"$f":"W136","v":0},null,null,null,null,null,null,null,null,{"$f":"RICHIESTA!I138","v":0},"Pubblica",{"$f":"SUMIF($J$29:$J$128,$S136,T$29:T$129)","v":0},{"$f":"SUMIF(J$29:J$128,$S136,U$29:U$128)","v":0},{"$f":"SUMIF(J$29:J$128,$S136,V$29:V$128)","v":0},{"$f":"SUMIF(J$29:J$128,$S136,I$29:I$128)","v":0}]
[{"$f":"R137","v":0},"ONLUS",null,null,{"$f":"T137","v":0},{"$f":"V137","v":0},{"$f":"U137","v":0},{"$f":"Y153","v":0},0,null,null,null,null,null,null,null,null,{"$f":"RICHIESTA!I139","v":0},"ONLUS",{"$f":"SUMIF($J$29:$J$128,$S137,T$29:T$129)","v":0},{"$f":"SUMIF(J$29:J$128,$S137,U$29:U$128)","v":0},{"$f":"SUMIF(J$29:J$128,$S137,V$29:V$128)","v":0},{"$f":"SUMIF(J$29:J$128,$S137,I$29:I$128)","v":0}]
[null,"TOTALE",null,null,{"$f":"SUM(E135:E137)","v":0},{"$f":"SUM(F135:F137)","v":0},{"$f":"SUM(G135:G137)","v":0},{"$f":"SUM(H135:H137)","v":0},{"$f":"SUM(I135:I137)","v":0},null,null,null,null,null,null,null,null,null,null,{"$f":"SUM(T135:T137)","v":0},{"$f":"SUM(U135:U137)","v":0},{"$f":"SUM(V135:V137)","v":0},0]
[null,"NOTE"]
[null,"Almeno uno dei soggetti può detrarre l'IVA",null,null,null,null,null,null,{"$f":"RICHIESTA!K140","v":"N"}]
[null,"Almeno una UI NON è alloggio principale / attività produttiva in esercizio",null,null,null,null,null,null,{"$f":"IF(RICHIESTA!E140,\"N\",\"S\")","v":"N"}]
[null,"Almeno una UI ha superato il costo parametrico",null,null,null,null,null,null,{"$f":"RICHIESTA!AS140","v":"N"}]
[null,"E' stato superato il rapporto percentuale tra strutture e finiture",null,null,null,null,null,null,{"$f":"IF(RICHIESTA!Q103<RICHIESTA!Q102,\"S\",\"N\")","v":"S"}]
[null,"E' stato superato il limite per le spese tecniche di progettazione",null,null,null,null,null,null,{"$f":"IF(SUM(RICHIESTA!M113:M118)>SUM(RICHIESTA!Y113:Y118),\"S\",\"N\")","v":"N"}]
[null,"E' stato superato il limite per le spese tecniche di coordinamento alla sicurezza",null,null,null,null,null,null,{"$f":"IF(SUM(RICHIESTA!M119:M120)>SUM(RICHIESTA!Y119:Y120),\"S\",\"N\")","v":"N"}]
[null,"E' stato superato il limite per le spese tecniche di direzione lavori",null,null,null,null,null,null,{"$f":"IF(SUM(RICHIESTA!M121:M122)>SUM(RICHIESTA!Y121:Y122),\"S\",\"N\")","v":"N"}]
[null,"E' stato superato il limite per le spese tecniche di collaudo",null,null,null,null,null,null,{"$f":"IF(RICHIESTA!M123>RICHIESTA!Y123,\"S\",\"N\")","v":"N"}]
[null,"E' stato superato il limite per le altre prestazioni tecniche o relazione geologica",null,null,null,null,null,null,{"$f":"IF(SUM(RICHIESTA!M125:M126)>SUM(RICHIESTA!Y125:Y126),\"S\",\"N\")","v":"N"}]
[null,"E' stato superato il limite per compensi per amministratori",null,null,null,null,null,null,{"$f":"IF(RICHIESTA!M127>RICHIESTA!Y127,\"S\",\"N\")","v":"N"},null,null,null,null,null,null,null,null,null,null,null,null,null,{"$f":"+IF(RICHIESTA!$E$16=W151,$W138-SUM($W172:$Y172),0)","v":0},{"$f":"+IF(RICHIESTA!$E$16=X151,$W138-SUM($W172:$Y172),0)","v":0},{"$f":"+IF(RICHIESTA!$E$16=Y151,$W138-SUM($W172:$Y172),0)","v":0}]
[null,null,null,null,null,null,null,null,null,null,null,null,null,null,null,null,null,"REALE",null,null,null,null,"ARROTONDATO"]
[null,"DESTINAZIONE PAGAMENTI PER RUOLO",null,null,null,null,null,null,null,null,null,null,null,null,null,null,null,"Privata","Pubblica","ONLUS",null,null,"Privata","Pubblica","ONLUS"]
[null,"NOME E COGNOME",null,null,null,"PRIVATI","ENTI PUBBLICI","ONLUS","TOTALE",null,null,null,null,null,null,null,null,{"$f":"RICHIESTA!I137","v":1E-13},{"$f":"RICHIESTA!I138","v":0},{"$f":"RICHIESTA!I139","v":0}]
["PROP","PROPRIETARIO",null,null,null,{"$f":"W153","v":0},{"$f":"X153","v":0},{"$f":"Y153","v":0},{"$f":"SUM(F153:H153)","v":0},null,null,null,null,null,null,null,null,{"$f":"IF(RICHIESTA!$E$16=R151,RICHIESTA!$AE$128,0)","v":0},{"$f":"IF(RICHIESTA!$E$16=S151,RICHIESTA!$AE$128,0)","v":0},{"$f":"IF(RICHIESTA!$E$16=T151,RICHIESTA!$AE$128,0)","v":0},null,null,{"$f":"ROUND(R153,2)","v":0},{"$f":"ROUND(S153,2)","v":0},{"$f":"ROUND(T153,2)","v":0}]
["PROVE","IMPRESA PROVE",null,null,null,{"$f":"W154","v":0},{"$f":"X154","v":0},{"$f":"Y154","v":0},{"$f":"SUM(F154:H154)","v":0},null,null,null,null,null,null,null,null,{"$f":"IF(RICHIESTA!$E$16=R151,RICHIESTA!$AB105-RICHIESTA!$AE105,0)","v":0},{"$f":"IF(RICHIESTA!$E$16=S151,RICHIESTA!$AB105-RICHIESTA!$AE105,0)","v":0},{"$f":"IF(RICHIESTA!$E$16=T151,RICHIESTA!$AB105-RICHIESTA!$AE105,0)","v":0},null,null,{"$f":"ROUND(R154,2)","v":0},{"$f":"ROUND(S154,2)","v":0},{"$f":"ROUND(T154,2)","v":0}]
["IMPR","IMPRESA LAVORI",null,null,null,{"$f":"W155+W149","v":0},{"$f":"X155+X149","v":0},0,{"$f":"SUM(F155:H155)","v":0},null,null,null,null,null,null,null,null,{"$f":"IF(RICHIESTA!$E$16=R151,SUM(RICHIESTA!$AB106:$AB108)-SUM(RICHIESTA!$AE106:$AE109),0)+SUMIF(RICHIESTA!$I$142:$I$241,R151,RICHIESTA!$BC$142:$BC$241)","v":1.1000000000000004E-33},{"$f":"IF(RICHIESTA!$E$16=S151,SUM(RICHIESTA!$AB106:$AB108)-SUM(RICHIESTA!$AE106:$AE109),0)+SUMIF(RICHIESTA!$I$142:$I$241,S151,RICHIESTA!$BC$142:$BC$241)","v":0},{"$f":"IF(RICHIESTA!$E$16=T151,SUM(RICHIESTA!$AB106:$AB108)-SUM(RICHIESTA!$AE106:$AE109),0)+SUMIF(RICHIESTA!$I$142:$I$241,T151,RICHIESTA!$BC$142:$BC$241)","v":0},null,null,{"$f":"ROUND(R155,2)","v":0},{"$f":"ROUND(S155,2)","v":0},{"$f":"ROUND(T155,2)","v":0}]
["AEDES","COMPILATORE AEDES",null,null,null,0,0,0,0,null,null,null,null,null,null,null,null,{"$f":"IF(RICHIESTA!$E$16=R$151,RICHIESTA!$AB113-RICHIESTA!$AE113,0)","v":0},{"$f":"IF(RICHIESTA!$E$16=S$151,RICHIESTA!$AB113-RICHIESTA!$AE113,0)","v":0},{"$f":"IF(RICHIESTA!$E$16=T$151,RICHIESTA!$AB113-RICHIESTA!$AE113,0)","v":0},null,null,{"$f":"ROUND(R156,2)","v":0},0,0]
["PROG","PROGETTISTA ARCHIETTONICO",null,null,null,0,0,0,0,null,null,null,null,null,null,null,null,{"$f":"IF(RICHIESTA!$E$16=R$151,RICHIESTA!$AB114-RICHIESTA!$AE114,0)","v":0},{"$f":"IF(RICHIESTA!$E$16=S$151,RICHIESTA!$AB114-RICHIESTA!$AE114,0)","v":0},{"$f":"IF(RICHIESTA!$E$16=T$151,RICHIESTA!$AB114-RICHIESTA!$AE114,0)","v":0},null,null,0,0,0]
["STRUT","PROGETTISTA STRUTTURE",null,null,null,0,0,0,0,null,null,null,null,null,null,null,null,{"$f":"IF(RICHIESTA!$E$16=R$151,RICHIESTA!$AB115-RICHIESTA!$AE115,0)","v":0},{"$f":"IF(RICHIESTA!$E$16=S$151,RICHIESTA!$AB115-RICHIESTA!$AE115,0)","v":0},{"$f":"IF(RICHIESTA!$E$16=T$151,RICHIESTA!$AB115-RICHIESTA!$AE115,0)","v":0},null,null,0,0,0]
["ELET","PROGETTISTA IMPIANTI ELETTRICI",null,null,null,0,0,0,0,null,null,null,null,null,null,null,null,{"$f":"IF(RICHIESTA!$E$16=R$151,RICHIESTA!$AB116-RICHIESTA!$AE116,0)","v":0},{"$f":"IF(RICHIESTA!$E$16=S$151,RICHIESTA!$AB116-RICHIESTA!$AE116,0)","v":0},{"$f":"IF(RICHIESTA!$E$16=T$151,RICHIESTA!$AB116-RICHIESTA!$AE116,0)","v":0},null,null,0,0,0]
["TERM","PROGETTISTA IMPIANTI TERMICI",null,null,null,0,0,0,0,null,null,null,null,null,null,null,null,{"$f":"IF(RICHIESTA!$E$16=R$151,RICHIESTA!$AB117-RICHIESTA!$AE117,0)","v":0},{"$f":"IF(RICHIESTA!$E$16=S$151,RICHIESTA!$AB117-RICHIESTA!$AE117,0)","v":0},{"$f":"IF(RICHIESTA!$E$16=T$151,RICHIESTA!$AB117-RICHIESTA!$AE117,0)","v":0},null,null,0,0,0]
["SPEC","PRESTAZIONI SPECIALISTICHE",null,null,null,0,0,0,0,null,null,null,null,null,null,null,null,{"$f":"IF(RICHIESTA!$E$16=R$151,RICHIESTA!$AB118-RICHIESTA!$AE118,0)","v":0},{"$f":"IF(RICHIESTA!$E$16=S$151,RICHIESTA!$AB118-RICHIESTA!$AE118,0)","v":0},{"$f":"IF(RICHIESTA!$E$16=T$151,RICHIESTA!$AB118-RICHIESTA!$AE118,0)","v":0},null,null,0,0,0]
["SICP","COORD SICUREZZA PROGETTAZIONE",null,null,null,0,0,0,0,null,null,null,null,null,null,null,null,{"$f":"IF(RICHIESTA!$E$16=R$151,RICHIESTA!$AB119-RICHIESTA!$AE119,0)","v":0},{"$f":"IF(RICHIESTA!$E$16=S$151,RICHIESTA!$AB119-RICHIESTA!$AE119,0)","v":0},{"$f":"IF(RICHIESTA!$E$16=T$151,RICHIESTA!$AB119-RICHIESTA!$AE119,0)","v":0},null,null,0,0,0]
["SICE","COORD SICUREZZA ESECUZIONE",null,null,null,0,0,0,0,null,null,null,null,null,null,null,null,{"$f":"IF(RICHIESTA!$E$16=R$151,RICHIESTA!$AB120-RICHIESTA!$AE120,0)","v":0},{"$f":"IF(RICHIESTA!$E$16=S$151,RICHIESTA!$AB120-RICHIESTA!$AE120,0)","v":0},{"$f":"IF(RICHIESTA!$E$16=T$151,RICHIESTA!$AB120-RICHIESTA!$AE120,0)","v":0},null,null,0,0,0]
["DLAV","DIRETTORE LAVORI",null,null,null,0,0,0,0,null,null,null,null,null,null,null,null,{"$f":"IF(RICHIESTA!$E$16=R$151,RICHIESTA!$AB121-RICHIESTA!$AE121,0)","v":0},{"$f":"IF(RICHIESTA!$E$16=S$151,RICHIESTA!$AB121-RICHIESTA!$AE121,0)","v":0},{"$f":"IF(RICHIESTA!$E$16=T$151,RICHIESTA!$AB121-RICHIESTA!$AE121,0)","v":0},null,null,0,0,0]
["DSTRU","DIRETTORE LAVORI STRUTTURALI",null,null,null,0,0,0,0,null,null,null,null,null,null,null,null,{"$f":"IF(RICHIESTA!$E$16=R$151,RICHIESTA!$AB122-RICHIESTA!$AE122,0)","v":0},{"$f":"IF(RICHIESTA!$E$16=S$151,RICHIESTA!$AB122-RICHIESTA!$AE122,0)","v":0},{"$f":"IF(RICHIESTA!$E$16=T$151,RICHIESTA!$AB122-RICHIESTA!$AE122,0)","v":0},null,null,0,0,0]
["COLL","COLLAUDATORE",null,null,null,0,0,0,0,null,null,null,null,null,null,null,null,{"$f":"IF(RICHIESTA!$E$16=R$151,RICHIESTA!$AB123-RICHIESTA!$AE123,0)","v":0},{"$f":"IF(RICHIESTA!$E$16=S$151,RICHIESTA!$AB123-RICHIESTA!$AE123,0)","v":0},{"$f":"IF(RICHIESTA!$E$16=T$151,RICHIESTA!$AB123-RICHIESTA!$AE123,0)","v":0},null,null,0,0,0]
["CERT","CERTIFICATORE ENERGETICO",null,null,null,{"$f":"W167","v":0},{"$f":"X167","v":0},{"$f":"Y167","v":0},0,null,null,null,null,null,null,null,null,{"$f":"IF(RICHIESTA!$E$16=R$151,RICHIESTA!$AB124-RICHIESTA!$AE124,0)","v":0},{"$f":"IF(RICHIESTA!$E$16=S$151,RICHIESTA!$AB124-RICHIESTA!$AE124,0)","v":0},{"$f":"IF(RICHIESTA!$E$16=T$151,RICHIESTA!$AB124-RICHIESTA!$AE124,0)","v":0},null,null,{"$f":"ROUND(R167,2)","v":0},{"$f":"ROUND(S167,2)","v":0},{"$f":"ROUND(T167,2)","v":0}]
["GEOL","GEOLOGO",null,null,null,0,0,0,0,null,null,null,null,null,null,null,null,{"$f":"IF(RICHIESTA!$E$16=R$151,RICHIESTA!$AB125-RICHIESTA!$AE125,0)","v":0},{"$f":"IF(RICHIESTA!$E$16=S$151,RICHIESTA!$AB125-RICHIESTA!$AE125,0)","v":0},{"$f":"IF(RICHIESTA!$E$16=T$151,RICHIESTA!$AB125-RICHIESTA!$AE125,0)","v":0},null,null,0,0,0]
["ALT","ALTRE PRESTAZIONI SPECIALISTICHE",null,null,null,0,0,0,0,null,null,null,null,null,null,null,null,{"$f":"IF(RICHIESTA!$E$16=R$151,RICHIESTA!$AB126-RICHIESTA!$AE126,0)","v":0},{"$f":"IF(RICHIESTA!$E$16=S$151,RICHIESTA!$AB126-RICHIESTA!$AE126,0)","v":0},{"$f":"IF(RICHIESTA!$E$16=T$151,RICHIESTA!$AB126-RICHIESTA!$AE126,0)","v":0},null,null,0,0,0]
["AMMI","AMMINISTRATORE",null,null,null,0,0,0,0,null,null,null,null,null,null,null,null,{"$f":"IF(RICHIESTA!$E$16=R$151,RICHIESTA!$AB127-RICHIESTA!$AE127,0)","v":0},{"$f":"IF(RICHIESTA!$E$16=S$151,RICHIESTA!$AB127-RICHIESTA!$AE127,0)","v":0},{"$f":"IF(RICHIESTA!$E$16=T$151,RICHIESTA!$AB127-RICHIESTA!$AE127,0)","v":0},null,null,0,0,0]
["DELOC","PROPRIETARI TERRENO DELOCALIZZAZIONE",null,null,null,0,0,0,0,null,null,null,null,null,null,null,null,{"$f":"SUM(R177:R179)","v":0},{"$f":"SUM(S177:S179)","v":0},0,null,null,{"$f":"ROUND(R171,2)","v":0},{"$f":"ROUND(S171,2)","v":0},{"$f":"ROUND(T171,2)","v":0}]
[null,null,null,null,"TOTALE",{"$f":"SUM(F153:F171)","v":0},{"$f":"SUM(G153:G171)","v":0},{"$f":"SUM(H153:H171)","v":0},{"$f":"SUM(I153:I171)","v":0},null,null,null,null,null,null,null,null,{"$f":"SUM(R153:R171)","v":1.1000000000000004E-33},{"$f":"SUM(S153:S171)","v":0},0,null,null,{"$f":"SUM(W153:W171)","v":0},{"$f":"SUM(X153:X171)","v":0},0]
[]
[]
[null,null,null,null,null,null,null,null,null,null,null,null,null,null,null,null,null,"REALE",null,null,null,null,"ARROTONDATO"]
[null,null,null,null,null,null,null,null,null,null,null,null,null,null,null,null,null,"Privata","Pubblica","ONLUS",null,null,"PRIVATI","PUBBLICO","ONLUS"]
[null,"TABELLA A-BIS",null,null,null,null,null,null,null,null,null,null,null,null,null,null,null,{"$f":"RICHIESTA!$AB110*R$152-IF(RICHIESTA!$E$16=R$151,RICHIESTA!$AE110,0)","v":0},{"$f":"RICHIESTA!$AB110*S$152-IF(RICHIESTA!$E$16=S$151,RICHIESTA!$AE110,0)","v":0},{"$f":"RICHIESTA!$AB110*T$152-IF(RICHIESTA!$E$16=T$151,RICHIESTA!$AE110,0)","v":0},null,null,{"$f":"ROUND(R177,2)","v":0},{"$f":"ROUND(S177,2)","v":0},{"$f":"ROUND(T177,2)","v":0}]
[null,"DETTAGLIO DEGLI ACCOLLI PER LE PARTI COMUNI DA VERSARE AL CONDOMINIO",null,null,null,null,null,null,null,null,null,null,null,null,null,null,null,{"$f":"RICHIESTA!$AB112*R$152-IF(RICHIESTA!$E$16=R$151,RICHIESTA!$AE112,0)","v":0},{"$f":"RICHIESTA!$AB112*S$152-IF(RICHIESTA!$E$16=S$151,RICHIESTA!$AE112,0)","v":0},{"$f":"RICHIESTA!$AB112*T$152-IF(RICHIESTA!$E$16=T$151,RICHIESTA!$AE112,0)","v":0},null,null,0,0,0]
["UI","PERSONA FISICA / GIURIDICA",null,"UI%","US%","CONTRIBUTO","ACCOLLO",null,null,null,null,null,null,null,null,null,null,{"$f":"RICHIESTA!$AB111*R$152-IF(RICHIESTA!$E$16=R$151,RICHIESTA!$AE111,0)","v":0},{"$f":"RICHIESTA!$AB111*S$152-IF(RICHIESTA!$E$16=S$151,RICHIESTA!$AE111,0)","v":0},{"$f":"RICHIESTA!$AB111*T$152-IF(RICHIESTA!$E$16=T$151,RICHIESTA!$AE111,0)","v":0},null,null,0,0,0]
[{"$f":"RICHIESTA!C142","v":1},{"$f":"\"UNITA IMMOBILIARE \"&A180","v":"UNITA IMMOBILIARE 1"},null,1,{"$f":"INDEX(RICHIESTA!$X$142:$X$241,MATCH(A29,RICHIESTA!$C$142:$C$241,0))","v":1E-13},{"$f":"INDEX(RICHIESTA!$BB$142:$BB$241,MATCH(A180,RICHIESTA!$C$142:$C$241,0))*D180*($A$1=\"S\")","v":0},{"$f":"INDEX(RICHIESTA!$BE$142:$BE$241,MATCH(A180,RICHIESTA!$C$142:$C$241,0))*D180*($A$1=\"S\")","v":0}]
[{"$f":"RICHIESTA!C143","v":2},{"$f":"\"UNITA IMMOBILIARE \"&A181","v":"UNITA IMMOBILIARE 2"},null,1,{"$f":"INDEX(RICHIESTA!$X$142:$X$241,MATCH(A30,RICHIESTA!$C$142:$C$241,0))","v":0},{"$f":"INDEX(RICHIESTA!$BB$142:$BB$241,MATCH(A181,RICHIESTA!$C$142:$C$241,0))*D181*($A$1=\"S\")","v":0},{"$f":"INDEX(RICHIESTA!$BE$142:$BE$241,MATCH(A181,RICHIESTA!$C$142:$C$241,0))*D181*($A$1=\"S\")","v":0}]
[{"$f":"RICHIESTA!C144","v":3},"UNITA IMMOBILIARE 3",null,1,{"$f":"INDEX(RICHIESTA!$X$142:$X$241,MATCH(A31,RICHIESTA!$C$142:$C$241,0))","v":0},{"$f":"INDEX(RICHIESTA!$BB$142:$BB$241,MATCH(A182,RICHIESTA!$C$142:$C$241,0))*D182*($A$1=\"S\")","v":0},{"$f":"INDEX(RICHIESTA!$BE$142:$BE$241,MATCH(A182,RICHIESTA!$C$142:$C$241,0))*D182*($A$1=\"S\")","v":0}]
[{"$f":"RICHIESTA!C145","v":4},"UNITA IMMOBILIARE 4",null,1,{"$f":"INDEX(RICHIESTA!$X$142:$X$241,MATCH(A32,RICHIESTA!$C$142:$C$241,0))","v":0},{"$f":"INDEX(RICHIESTA!$BB$142:$BB$241,MATCH(A183,RICHIESTA!$C$142:$C$241,0))*D183*($A$1=\"S\")","v":0},{"$f":"INDEX(RICHIESTA!$BE$142:$BE$241,MATCH(A183,RICHIESTA!$C$142:$C$241,0))*D183*($A$1=\"S\")","v":0}]
[{"$f":"RICHIESTA!C146","v":5},"UNITA IMMOBILIARE 5",null,1,{"$f":"INDEX(RICHIESTA!$X$142:$X$241,MATCH(A33,RICHIESTA!$C$142:$C$241,0))","v":0},{"$f":"INDEX(RICHIESTA!$BB$142:$BB$241,MATCH(A184,RICHIESTA!$C$142:$C$241,0))*D184*($A$1=\"S\")","v":0},{"$f":"INDEX(RICHIESTA!$BE$142:$BE$241,MATCH(A184,RICHIESTA!$C$142:$C$241,0))*D184*($A$1=\"S\")","v":0}]
[{"$f":"RICHIESTA!C147","v":6},"UNITA IMMOBILIARE 6",null,1,{"$f":"INDEX(RICHIESTA!$X$142:$X$241,MATCH(A34,RICHIESTA!$C$142:$C$241,0))","v":0},{"$f":"INDEX(RICHIESTA!$BB$142:$BB$241,MATCH(A185,RICHIESTA!$C$142:$C$241,0))*D185*($A$1=\"S\")","v":0},{"$f":"INDEX(RICHIESTA!$BE$142:$BE$241,MATCH(A185,RICHIESTA!$C$142:$C$241,0))*D185*($A$1=\"S\")","v":0}]
[{"$f":"RICHIESTA!C148","v":7},"UNITA IMMOBILIARE 7",null,1,{"$f":"INDEX(RICHIESTA!$X$142:$X$241,MATCH(A35,RICHIESTA!$C$142:$C$241,0))","v":0},{"$f":"INDEX(RICHIESTA!$BB$142:$BB$241,MATCH(A186,RICHIESTA!$C$142:$C$241,0))*D186*($A$1=\"S\")","v":0},{"$f":"INDEX(RICHIESTA!$BE$142:$BE$241,MATCH(A186,RICHIESTA!$C$142:$C$241,0))*D186*($A$1=\"S\")","v":0}]
[{"$f":"RICHIESTA!C149","v":8},"UNITA IMMOBILIARE 8",null,1,{"$f":"INDEX(RICHIESTA!$X$142:$X$241,MATCH(A36,RICHIESTA!$C$142:$C$241,0))","v":0},{"$f":"INDEX(RICHIESTA!$BB$142:$BB$241,MATCH(A187,RICHIESTA!$C$142:$C$241,0))*D187*($A$1=\"S\")","v":0},{"$f":"INDEX(RICHIESTA!$BE$142:$BE$241,MATCH(A187,RICHIESTA!$C$142:$C$241,0))*D187*($A$1=\"S\")","v":0}]
[{"$f":"RICHIESTA!C150","v":9},"UNITA IMMOBILIARE 9",null,1,{"$f":"INDEX(RICHIESTA!$X$142:$X$241,MATCH(A37,RICHIESTA!$C$142:$C$241,0))","v":0},{"$f":"INDEX(RICHIESTA!$BB$142:$BB$241,MATCH(A188,RICHIESTA!$C$142:$C$241,0))*D188*($A$1=\"S\")","v":0},{"$f":"INDEX(RICHIESTA!$BE$142:$BE$241,MATCH(A188,RICHIESTA!$C$142:$C$241,0))*D188*($A$1=\"S\")","v":0}]
[{"$f":"RICHIESTA!C151","v":10},"UNITA IMMOBILIARE 10",null,1,{"$f":"INDEX(RICHIESTA!$X$142:$X$241,MATCH(A38,RICHIESTA!$C$142:$C$241,0))","v":0},{"$f":"INDEX(RICHIESTA!$BB$142:$BB$241,MATCH(A189,RICHIESTA!$C$142:$C$241,0))*D189*($A$1=\"S\")","v":0},{"$f":"INDEX(RICHIESTA!$BE$142:$BE$241,MATCH(A189,RICHIESTA!$C$142:$C$241,0))*D189*($A$1=\"S\")","v":0}]
[{"$f":"RICHIESTA!C152","v":11},"UNITA IMMOBILIARE 11",null,1,{"$f":"INDEX(RICHIESTA!$X$142:$X$241,MATCH(A39,RICHIESTA!$C$142:$C$241,0))","v":0},{"$f":"INDEX(RICHIESTA!$BB$142:$BB$241,MATCH(A190,RICHIESTA!$C$142:$C$241,0))*D190*($A$1=\"S\")","v":0},{"$f":"INDEX(RICHIESTA!$BE$142:$BE$241,MATCH(A190,RICHIESTA!$C$142:$C$241,0))*D190*($A$1=\"S\")","v":0}]
[{"$f":"RICHIESTA!C153","v":12},"UNITA IMMOBILIARE 12",null,1,{"$f":"INDEX(RICHIESTA!$X$142:$X$241,MATCH(A40,RICHIESTA!$C$142:$C$241,0))","v":0},{"$f":"INDEX(RICHIESTA!$BB$142:$BB$241,MATCH(A191,RICHIESTA!$C$142:$C$241,0))*D191*($A$1=\"S\")","v":0},{"$f":"INDEX(RICHIESTA!$BE$142:$BE$241,MATCH(A191,RICHIESTA!$C$142:$C$241,0))*D191*($A$1=\"S\")","v":0}]
[{"$f":"RICHIESTA!C154","v":13},"UNITA IMMOBILIARE 13",null,1,{"$f":"INDEX(RICHIESTA!$X$142:$X$241,MATCH(A41,RICHIESTA!$C$142:$C$241,0))","v":0},{"$f":"INDEX(RICHIESTA!$BB$142:$BB$241,MATCH(A192,RICHIESTA!$C$142:$C$241,0))*D192*($A$1=\"S\")","v":0},{"$f":"INDEX(RICHIESTA!$BE$142:$BE$241,MATCH(A192,RICHIESTA!$C$142:$C$241,0))*D192*($A$1=\"S\")","v":0}]
[{"$f":"RICHIESTA!C155","v":14},"UNITA IMMOBILIARE 14",null,1,{"$f":"INDEX(RICHIESTA!$X$142:$X$241,MATCH(A42,RICHIESTA!$C$142:$C$241,0))","v":0},{"$f":"INDEX(RICHIESTA!$BB$142:$BB$241,MATCH(A193,RICHIESTA!$C$142:$C$241,0))*D193*($A$1=\"S\")","v":0},{"$f":"INDEX(RICHIESTA!$BE$142:$BE$241,MATCH(A193,RICHIESTA!$C$142:$C$241,0))*D193*($A$1=\"S\")","v":0}]
[{"$f":"RICHIESTA!C156","v":15},"UNITA IMMOBILIARE 15",null,1,{"$f":"INDEX(RICHIESTA!$X$142:$X$241,MATCH(A43,RICHIESTA!$C$142:$C$241,0))","v":0},{"$f":"INDEX(RICHIESTA!$BB$142:$BB$241,MATCH(A194,RICHIESTA!$C$142:$C$241,0))*D194*($A$1=\"S\")","v":0},{"$f":"INDEX(RICHIESTA!$BE$142:$BE$241,MATCH(A194,RICHIESTA!$C$142:$C$241,0))*D194*($A$1=\"S\")","v":0}]
[{"$f":"RICHIESTA!C157","v":16},"UNITA IMMOBILIARE 16",null,1,{"$f":"INDEX(RICHIESTA!$X$142:$X$241,MATCH(A44,RICHIESTA!$C$142:$C$241,0))","v":0},{"$f":"INDEX(RICHIESTA!$BB$142:$BB$241,MATCH(A195,RICHIESTA!$C$142:$C$241,0))*D195*($A$1=\"S\")","v":0},{"$f":"INDEX(RICHIESTA!$BE$142:$BE$241,MATCH(A195,RICHIESTA!$C$142:$C$241,0))*D195*($A$1=\"S\")","v":0}]
[{"$f":"RICHIESTA!C158","v":17},"UNITA IMMOBILIARE 17",null,1,{"$f":"INDEX(RICHIESTA!$X$142:$X$241,MATCH(A45,RICHIESTA!$C$142:$C$241,0))","v":0},{"$f":"INDEX(RICHIESTA!$BB$142:$BB$241,MATCH(A196,RICHIESTA!$C$142:$C$241,0))*D196*($A$1=\"S\")","v":0},{"$f":"INDEX(RICHIESTA!$BE$142:$BE$241,MATCH(A196,RICHIESTA!$C$142:$C$241,0))*D196*($A$1=\"S\")","v":0}]
[{"$f":"RICHIESTA!C159","v":18},"UNITA IMMOBILIARE 18",null,1,{"$f":"INDEX(RICHIESTA!$X$142:$X$241,MATCH(A46,RICHIESTA!$C$142:$C$241,0))","v":0},{"$f":"INDEX(RICHIESTA!$BB$142:$BB$241,MATCH(A197,RICHIESTA!$C$142:$C$241,0))*D197*($A$1=\"S\")","v":0},{"$f":"INDEX(RICHIESTA!$BE$142:$BE$241,MATCH(A197,RICHIESTA!$C$142:$C$241,0))*D197*($A$1=\"S\")","v":0}]
[{"$f":"RICHIESTA!C160","v":19},"UNITA IMMOBILIARE 19",null,1,{"$f":"INDEX(RICHIESTA!$X$142:$X$241,MATCH(A47,RICHIESTA!$C$142:$C$241,0))","v":0},{"$f":"INDEX(RICHIESTA!$BB$142:$BB$241,MATCH(A198,RICHIESTA!$C$142:$C$241,0))*D198*($A$1=\"S\")","v":0},{"$f":"INDEX(RICHIESTA!$BE$142:$BE$241,MATCH(A198,RICHIESTA!$C$142:$C$241,0))*D198*($A$1=\"S\")","v":0}]
[{"$f":"RICHIESTA!C161","v":20},"UNITA IMMOBILIARE 20",null,1,{"$f":"INDEX(RICHIESTA!$X$142:$X$241,MATCH(A48,RICHIESTA!$C$142:$C$241,0))","v":0},{"$f":"INDEX(RICHIESTA!$BB$142:$BB$241,MATCH(A199,RICHIESTA!$C$142:$C$241,0))*D199*($A$1=\"S\")","v":0},{"$f":"INDEX(RICHIESTA!$BE$142:$BE$241,MATCH(A199,RICHIESTA!$C$142:$C$241,0))*D199*($A$1=\"S\")","v":0}]
[{"$f":"RICHIESTA!C162","v":21},"UNITA IMMOBILIARE 21",null,1,{"$f":"INDEX(RICHIESTA!$X$142:$X$241,MATCH(A49,RICHIESTA!$C$142:$C$241,0))","v":0},{"$f":"INDEX(RICHIESTA!$BB$142:$BB$241,MATCH(A200,RICHIESTA!$C$142:$C$241,0))*D200*($A$1=\"S\")","v":0},{"$f":"INDEX(RICHIESTA!$BE$142:$BE$241,MATCH(A200,RICHIESTA!$C$142:$C$241,0))*D200*($A$1=\"S\")","v":0}]
[{"$f":"RICHIESTA!C163","v":22},"UNITA IMMOBILIARE 22",null,1,{"$f":"INDEX(RICHIESTA!$X$142:$X$241,MATCH(A50,RICHIESTA!$C$142:$C$241,0))","v":0},{"$f":"INDEX(RICHIESTA!$BB$142:$BB$241,MATCH(A201,RICHIESTA!$C$142:$C$241,0))*D201*($A$1=\"S\")","v":0},{"$f":"INDEX(RICHIESTA!$BE$142:$BE$241,MATCH(A201,RICHIESTA!$C$142:$C$241,0))*D201*($A$1=\"S\")","v":0}]
[{"$f":"RICHIESTA!C164","v":23},"UNITA IMMOBILIARE 23",null,1,{"$f":"INDEX(RICHIESTA!$X$142:$X$241,MATCH(A51,RICHIESTA!$C$142:$C$241,0))","v":0},{"$f":"INDEX(RICHIESTA!$BB$142:$BB$241,MATCH(A202,RICHIESTA!$C$142:$C$241,0))*D202*($A$1=\"S\")","v":0},{"$f":"INDEX(RICHIESTA!$BE$142:$BE$241,MATCH(A202,RICHIESTA!$C$142:$C$241,0))*D202*($A$1=\"S\")","v":0}]
[{"$f":"RICHIESTA!C165","v":24},"UNITA IMMOBILIARE 24",null,1,{"$f":"INDEX(RICHIESTA!$X$142:$X$241,MATCH(A52,RICHIESTA!$C$142:$C$241,0))","v":0},{"$f":"INDEX(RICHIESTA!$BB$142:$BB$241,MATCH(A203,RICHIESTA!$C$142:$C$241,0))*D203*($A$1=\"S\")","v":0},{"$f":"INDEX(RICHIESTA!$BE$142:$BE$241,MATCH(A203,RICHIESTA!$C$142:$C$241,0))*D203*($A$1=\"S\")","v":0}]
[{"$f":"RICHIESTA!C166","v":25},"UNITA IMMOBILIARE 25",null,1,{"$f":"INDEX(RICHIESTA!$X$142:$X$241,MATCH(A53,RICHIESTA!$C$142:$C$241,0))","v":0},{"$f":"INDEX(RICHIESTA!$BB$142:$BB$241,MATCH(A204,RICHIESTA!$C$142:$C$241,0))*D204*($A$1=\"S\")","v":0},{"$f":"INDEX(RICHIESTA!$BE$142:$BE$241,MATCH(A204,RICHIESTA!$C$142:$C$241,0))*D204*($A$1=\"S\")","v":0}]
[{"$f":"RICHIESTA!C167","v":26},"UNITA IMMOBILIARE 26",null,1,{"$f":"INDEX(RICHIESTA!$X$142:$X$241,MATCH(A54,RICHIESTA!$C$142:$C$241,0))","v":0},{"$f":"INDEX(RICHIESTA!$BB$142:$BB$241,MATCH(A205,RICHIESTA!$C$142:$C$241,0))*D205*($A$1=\"S\")","v":0},{"$f":"INDEX(RICHIESTA!$BE$142:$BE$241,MATCH(A205,RICHIESTA!$C$142:$C$241,0))*D205*($A$1=\"S\")","v":0}]
[{"$f":"RICHIESTA!C168","v":27},"UNITA IMMOBILIARE 27",null,1,{"$f":"INDEX(RICHIESTA!$X$142:$X$241,MATCH(A55,RICHIESTA!$C$142:$C$241,0))","v":0},{"$f":"INDEX(RICHIESTA!$BB$142:$BB$241,MATCH(A206,RICHIESTA!$C$142:$C$241,0))*D206*($A$1=\"S\")","v":0},{"$f":"INDEX(RICHIESTA!$BE$142:$BE$241,MATCH(A206,RICHIESTA!$C$142:$C$241,0))*D206*($A$1=\"S\")","v":0}]
[{"$f":"RICHIESTA!C169","v":28},"UNITA IMMOBILIARE 28",null,1,{"$f":"INDEX(RICHIESTA!$X$142:$X$241,MATCH(A56,RICHIESTA!$C$142:$C$241,0))","v":0},{"$f":"INDEX(RICHIESTA!$BB$142:$BB$241,MATCH(A207,RICHIESTA!$C$142:$C$241,0))*D207*($A$1=\"S\")","v":0},{"$f":"INDEX(RICHIESTA!$BE$142:$BE$241,MATCH(A207,RICHIESTA!$C$142:$C$241,0))*D207*($A$1=\"S\")","v":0}]
[{"$f":"RICHIESTA!C170","v":29},"UNITA IMMOBILIARE 29",null,1,{"$f":"INDEX(RICHIESTA!$X$142:$X$241,MATCH(A57,RICHIESTA!$C$142:$C$241,0))","v":0},{"$f":"INDEX(RICHIESTA!$BB$142:$BB$241,MATCH(A208,RICHIESTA!$C$142:$C$241,0))*D208*($A$1=\"S\")","v":0},{"$f":"INDEX(RICHIESTA!$BE$142:$BE$241,MATCH(A208,RICHIESTA!$C$142:$C$241,0))*D208*($A$1=\"S\")","v":0}]
[{"$f":"RICHIESTA!C171","v":30},"UNITA IMMOBILIARE 30",null,1,{"$f":"INDEX(RICHIESTA!$X$142:$X$241,MATCH(A58,RICHIESTA!$C$142:$C$241,0))","v":0},{"$f":"INDEX(RICHIESTA!$BB$142:$BB$241,MATCH(A209,RICHIESTA!$C$142:$C$241,0))*D209*($A$1=\"S\")","v":0},{"$f":"INDEX(RICHIESTA!$BE$142:$BE$241,MATCH(A209,RICHIESTA!$C$142:$C$241,0))*D209*($A$1=\"S\")","v":0}]
[{"$f":"RICHIESTA!C172","v":31},"UNITA IMMOBILIARE 31",null,1,{"$f":"INDEX(RICHIESTA!$X$142:$X$241,MATCH(A59,RICHIESTA!$C$142:$C$241,0))","v":0},{"$f":"INDEX(RICHIESTA!$BB$142:$BB$241,MATCH(A210,RICHIESTA!$C$142:$C$241,0))*D210*($A$1=\"S\")","v":0},{"$f":"INDEX(RICHIESTA!$BE$142:$BE$241,MATCH(A210,RICHIESTA!$C$142:$C$241,0))*D210*($A$1=\"S\")","v":0}]
[{"$f":"RICHIESTA!C173","v":32},"UNITA IMMOBILIARE 32",null,1,{"$f":"INDEX(RICHIESTA!$X$142:$X$241,MATCH(A60,RICHIESTA!$C$142:$C$241,0))","v":0},{"$f":"INDEX(RICHIESTA!$BB$142:$BB$241,MATCH(A211,RICHIESTA!$C$142:$C$241,0))*D211*($A$1=\"S\")","v":0},{"$f":"INDEX(RICHIESTA!$BE$142:$BE$241,MATCH(A211,RICHIESTA!$C$142:$C$241,0))*D211*($A$1=\"S\")","v":0}]
[{"$f":"RICHIESTA!C174","v":33},"UNITA IMMOBILIARE 33",null,1,{"$f":"INDEX(RICHIESTA!$X$142:$X$241,MATCH(A61,RICHIESTA!$C$142:$C$241,0))","v":0},{"$f":"INDEX(RICHIESTA!$BB$142:$BB$241,MATCH(A212,RICHIESTA!$C$142:$C$241,0))*D212*($A$1=\"S\")","v":0},{"$f":"INDEX(RICHIESTA!$BE$142:$BE$241,MATCH(A212,RICHIESTA!$C$142:$C$241,0))*D212*($A$1=\"S\")","v":0}]
[{"$f":"RICHIESTA!C175","v":34},"UNITA IMMOBILIARE 34",null,1,{"$f":"INDEX(RICHIESTA!$X$142:$X$241,MATCH(A62,RICHIESTA!$C$142:$C$241,0))","v":0},{"$f":"INDEX(RICHIESTA!$BB$142:$BB$241,MATCH(A213,RICHIESTA!$C$142:$C$241,0))*D213*($A$1=\"S\")","v":0},{"$f":"INDEX(RICHIESTA!$BE$142:$BE$241,MATCH(A213,RICHIESTA!$C$142:$C$241,0))*D213*($A$1=\"S\")","v":0}]
[{"$f":"RICHIESTA!C176","v":35},"UNITA IMMOBILIARE 35",null,1,{"$f":"INDEX(RICHIESTA!$X$142:$X$241,MATCH(A63,RICHIESTA!$C$142:$C$241,0))","v":0},{"$f":"INDEX(RICHIESTA!$BB$142:$BB$241,MATCH(A214,RICHIESTA!$C$142:$C$241,0))*D214*($A$1=\"S\")","v":0},{"$f":"INDEX(RICHIESTA!$BE$142:$BE$241,MATCH(A214,RICHIESTA!$C$142:$C$241,0))*D214*($A$1=\"S\")","v":0}]
[{"$f":"RICHIESTA!C177","v":36},"UNITA IMMOBILIARE 36",null,1,{"$f":"INDEX(RICHIESTA!$X$142:$X$241,MATCH(A64,RICHIESTA!$C$142:$C$241,0))","v":0},{"$f":"INDEX(RICHIESTA!$BB$142:$BB$241,MATCH(A215,RICHIESTA!$C$142:$C$241,0))*D215*($A$1=\"S\")","v":0},{"$f":"INDEX(RICHIESTA!$BE$142:$BE$241,MATCH(A215,RICHIESTA!$C$142:$C$241,0))*D215*($A$1=\"S\")","v":0}]
[{"$f":"RICHIESTA!C178","v":37},"UNITA IMMOBILIARE 37",null,1,{"$f":"INDEX(RICHIESTA!$X$142:$X$241,MATCH(A65,RICHIESTA!$C$142:$C$241,0))","v":0},{"$f":"INDEX(RICHIESTA!$BB$142:$BB$241,MATCH(A216,RICHIESTA!$C$142:$C$241,0))*D216*($A$1=\"S\")","v":0},{"$f":"INDEX(RICHIESTA!$BE$142:$BE$241,MATCH(A216,RICHIESTA!$C$142:$C$241,0))*D216*($A$1=\"S\")","v":0}]
[{"$f":"RICHIESTA!C179","v":38},"UNITA IMMOBILIARE 38",null,1,{"$f":"INDEX(RICHIESTA!$X$142:$X$241,MATCH(A66,RICHIESTA!$C$142:$C$241,0))","v":0},{"$f":"INDEX(RICHIESTA!$BB$142:$BB$241,MATCH(A217,RICHIESTA!$C$142:$C$241,0))*D217*($A$1=\"S\")","v":0},{"$f":"INDEX(RICHIESTA!$BE$142:$BE$241,MATCH(A217,RICHIESTA!$C$142:$C$241,0))*D217*($A$1=\"S\")","v":0}]
[{"$f":"RICHIESTA!C180","v":39},"UNITA IMMOBILIARE 39",null,1,{"$f":"INDEX(RICHIESTA!$X$142:$X$241,MATCH(A67,RICHIESTA!$C$142:$C$241,0))","v":0},{"$f":"INDEX(RICHIESTA!$BB$142:$BB$241,MATCH(A218,RICHIESTA!$C$142:$C$241,0))*D218*($A$1=\"S\")","v":0},{"$f":"INDEX(RICHIESTA!$BE$142:$BE$241,MATCH(A218,RICHIESTA!$C$142:$C$241,0))*D218*($A$1=\"S\")","v":0}]
[{"$f":"RICHIESTA!C181","v":40},"UNITA IMMOBILIARE 40",null,1,{"$f":"INDEX(RICHIESTA!$X$142:$X$241,MATCH(A68,RICHIESTA!$C$142:$C$241,0))","v":0},{"$f":"INDEX(RICHIESTA!$BB$142:$BB$241,MATCH(A219,RICHIESTA!$C$142:$C$241,0))*D219*($A$1=\"S\")","v":0},{"$f":"INDEX(RICHIESTA!$BE$142:$BE$241,MATCH(A219,RICHIESTA!$C$142:$C$241,0))*D219*($A$1=\"S\")","v":0}]
[{"$f":"RICHIESTA!C182","v":41},"UNITA IMMOBILIARE 41",null,1,{"$f":"INDEX(RICHIESTA!$X$142:$X$241,MATCH(A69,RICHIESTA!$C$142:$C$241,0))","v":0},{"$f":"INDEX(RICHIESTA!$BB$142:$BB$241,MATCH(A220,RICHIESTA!$C$142:$C$241,0))*D220*($A$1=\"S\")","v":0},{"$f":"INDEX(RICHIESTA!$BE$142:$BE$241,MATCH(A220,RICHIESTA!$C$142:$C$241,0))*D220*($A$1=\"S\")","v":0}]
[{"$f":"RICHIESTA!C183","v":42},"UNITA IMMOBILIARE 42",null,1,{"$f":"INDEX(RICHIESTA!$X$142:$X$241,MATCH(A70,RICHIESTA!$C$142:$C$241,0))","v":0},{"$f":"INDEX(RICHIESTA!$BB$142:$BB$241,MATCH(A221,RICHIESTA!$C$142:$C$241,0))*D221*($A$1=\"S\")","v":0},{"$f":"INDEX(RICHIESTA!$BE$142:$BE$241,MATCH(A221,RICHIESTA!$C$142:$C$241,0))*D221*($A$1=\"S\")","v":0}]
[{"$f":"RICHIESTA!C184","v":43},"UNITA IMMOBILIARE 43",null,1,{"$f":"INDEX(RICHIESTA!$X$142:$X$241,MATCH(A71,RICHIESTA!$C$142:$C$241,0))","v":0},{"$f":"INDEX(RICHIESTA!$BB$142:$BB$241,MATCH(A222,RICHIESTA!$C$142:$C$241,0))*D222*($A$1=\"S\")","v":0},{"$f":"INDEX(RICHIESTA!$BE$142:$BE$241,MATCH(A222,RICHIESTA!$C$142:$C$241,0))*D222*($A$1=\"S\")","v":0}]
[{"$f":"RICHIESTA!C185","v":44},"UNITA IMMOBILIARE 44",null,1,{"$f":"INDEX(RICHIESTA!$X$142:$X$241,MATCH(A72,RICHIESTA!$C$142:$C$241,0))","v":0},{"$f":"INDEX(RICHIESTA!$BB$142:$BB$241,MATCH(A223,RICHIESTA!$C$142:$C$241,0))*D223*($A$1=\"S\")","v":0},{"$f":"INDEX(RICHIESTA!$BE$142:$BE$241,MATCH(A223,RICHIESTA!$C$142:$C$241,0))*D223*($A$1=\"S\")","v":0}]
[{"$f":"RICHIESTA!C186","v":45},"UNITA IMMOBILIARE 45",null,1,{"$f":"INDEX(RICHIESTA!$X$142:$X$241,MATCH(A73,RICHIESTA!$C$142:$C$241,0))","v":0},{"$f":"INDEX(RICHIESTA!$BB$142:$BB$241,MATCH(A224,RICHIESTA!$C$142:$C$241,0))*D224*($A$1=\"S\")","v":0},{"$f":"INDEX(RICHIESTA!$BE$142:$BE$241,MATCH(A224,RICHIESTA!$C$142:$C$241,0))*D224*($A$1=\"S\")","v":0}]
[{"$f":"RICHIESTA!C187","v":46},"UNITA IMMOBILIARE 46",null,1,{"$f":"INDEX(RICHIESTA!$X$142:$X$241,MATCH(A74,RICHIESTA!$C$142:$C$241,0))","v":0},{"$f":"INDEX(RICHIESTA!$BB$142:$BB$241,MATCH(A225,RICHIESTA!$C$142:$C$241,0))*D225*($A$1=\"S\")","v":0},{"$f":"INDEX(RICHIESTA!$BE$142:$BE$241,MATCH(A225,RICHIESTA!$C$142:$C$241,0))*D225*($A$1=\"S\")","v":0}]
[{"$f":"RICHIESTA!C188","v":47},"UNITA IMMOBILIARE 47",null,1,{"$f":"INDEX(RICHIESTA!$X$142:$X$241,MATCH(A75,RICHIESTA!$C$142:$C$241,0))","v":0},{"$f":"INDEX(RICHIESTA!$BB$142:$BB$241,MATCH(A226,RICHIESTA!$C$142:$C$241,0))*D226*($A$1=\"S\")","v":0},{"$f":"INDEX(RICHIESTA!$BE$142:$BE$241,MATCH(A226,RICHIESTA!$C$142:$C$241,0))*D226*($A$1=\"S\")","v":0}]
[{"$f":"RICHIESTA!C189","v":48},"UNITA IMMOBILIARE 48",null,1,{"$f":"INDEX(RICHIESTA!$X$142:$X$241,MATCH(A76,RICHIESTA!$C$142:$C$241,0))","v":0},{"$f":"INDEX(RICHIESTA!$BB$142:$BB$241,MATCH(A227,RICHIESTA!$C$142:$C$241,0))*D227*($A$1=\"S\")","v":0},{"$f":"INDEX(RICHIESTA!$BE$142:$BE$241,MATCH(A227,RICHIESTA!$C$142:$C$241,0))*D227*($A$1=\"S\")","v":0}]
[{"$f":"RICHIESTA!C190","v":49},"UNITA IMMOBILIARE 49",null,1,{"$f":"INDEX(RICHIESTA!$X$142:$X$241,MATCH(A77,RICHIESTA!$C$142:$C$241,0))","v":0},{"$f":"INDEX(RICHIESTA!$BB$142:$BB$241,MATCH(A228,RICHIESTA!$C$142:$C$241,0))*D228*($A$1=\"S\")","v":0},{"$f":"INDEX(RICHIESTA!$BE$142:$BE$241,MATCH(A228,RICHIESTA!$C$142:$C$241,0))*D228*($A$1=\"S\")","v":0}]
[{"$f":"RICHIESTA!C191","v":50},"UNITA IMMOBILIARE 50",null,1,{"$f":"INDEX(RICHIESTA!$X$142:$X$241,MATCH(A78,RICHIESTA!$C$142:$C$241,0))","v":0},{"$f":"INDEX(RICHIESTA!$BB$142:$BB$241,MATCH(A229,RICHIESTA!$C$142:$C$241,0))*D229*($A$1=\"S\")","v":0},{"$f":"INDEX(RICHIESTA!$BE$142:$BE$241,MATCH(A229,RICHIESTA!$C$142:$C$241,0))*D229*($A$1=\"S\")","v":0}]
[{"$f":"RICHIESTA!C192","v":51},"UNITA IMMOBILIARE 51",null,1,{"$f":"INDEX(RICHIESTA!$X$142:$X$241,MATCH(A79,RICHIESTA!$C$142:$C$241,0))","v":0},{"$f":"INDEX(RICHIESTA!$BB$142:$BB$241,MATCH(A230,RICHIESTA!$C$142:$C$241,0))*D230*($A$1=\"S\")","v":0},{"$f":"INDEX(RICHIESTA!$BE$142:$BE$241,MATCH(A230,RICHIESTA!$C$142:$C$241,0))*D230*($A$1=\"S\")","v":0}]
[{"$f":"RICHIESTA!C193","v":52},"UNITA IMMOBILIARE 52",null,1,{"$f":"INDEX(RICHIESTA!$X$142:$X$241,MATCH(A80,RICHIESTA!$C$142:$C$241,0))","v":0},{"$f":"INDEX(RICHIESTA!$BB$142:$BB$241,MATCH(A231,RICHIESTA!$C$142:$C$241,0))*D231*($A$1=\"S\")","v":0},{"$f":"INDEX(RICHIESTA!$BE$142:$BE$241,MATCH(A231,RICHIESTA!$C$142:$C$241,0))*D231*($A$1=\"S\")","v":0}]
[{"$f":"RICHIESTA!C194","v":53},"UNITA IMMOBILIARE 53",null,1,{"$f":"INDEX(RICHIESTA!$X$142:$X$241,MATCH(A81,RICHIESTA!$C$142:$C$241,0))","v":0},{"$f":"INDEX(RICHIESTA!$BB$142:$BB$241,MATCH(A232,RICHIESTA!$C$142:$C$241,0))*D232*($A$1=\"S\")","v":0},{"$f":"INDEX(RICHIESTA!$BE$142:$BE$241,MATCH(A232,RICHIESTA!$C$142:$C$241,0))*D232*($A$1=\"S\")","v":0}]
[{"$f":"RICHIESTA!C195","v":54},"UNITA IMMOBILIARE 54",null,1,{"$f":"INDEX(RICHIESTA!$X$142:$X$241,MATCH(A82,RICHIESTA!$C$142:$C$241,0))","v":0},{"$f":"INDEX(RICHIESTA!$BB$142:$BB$241,MATCH(A233,RICHIESTA!$C$142:$C$241,0))*D233*($A$1=\"S\")","v":0},{"$f":"INDEX(RICHIESTA!$BE$142:$BE$241,MATCH(A233,RICHIESTA!$C$142:$C$241,0))*D233*($A$1=\"S\")","v":0}]
[{"$f":"RICHIESTA!C196","v":55},"UNITA IMMOBILIARE 55",null,1,{"$f":"INDEX(RICHIESTA!$X$142:$X$241,MATCH(A83,RICHIESTA!$C$142:$C$241,0))","v":0},{"$f":"INDEX(RICHIESTA!$BB$142:$BB$241,MATCH(A234,RICHIESTA!$C$142:$C$241,0))*D234*($A$1=\"S\")","v":0},{"$f":"INDEX(RICHIESTA!$BE$142:$BE$241,MATCH(A234,RICHIESTA!$C$142:$C$241,0))*D234*($A$1=\"S\")","v":0}]
[{"$f":"RICHIESTA!C197","v":56},"UNITA IMMOBILIARE 56",null,1,{"$f":"INDEX(RICHIESTA!$X$142:$X$241,MATCH(A84,RICHIESTA!$C$142:$C$241,0))","v":0},{"$f":"INDEX(RICHIESTA!$BB$142:$BB$241,MATCH(A235,RICHIESTA!$C$142:$C$241,0))*D235*($A$1=\"S\")","v":0},{"$f":"INDEX(RICHIESTA!$BE$142:$BE$241,MATCH(A235,RICHIESTA!$C$142:$C$241,0))*D235*($A$1=\"S\")","v":0}]
[{"$f":"RICHIESTA!C198","v":57},"UNITA IMMOBILIARE 57",null,1,{"$f":"INDEX(RICHIESTA!$X$142:$X$241,MATCH(A85,RICHIESTA!$C$142:$C$241,0))","v":0},{"$f":"INDEX(RICHIESTA!$BB$142:$BB$241,MATCH(A236,RICHIESTA!$C$142:$C$241,0))*D236*($A$1=\"S\")","v":0},{"$f":"INDEX(RICHIESTA!$BE$142:$BE$241,MATCH(A236,RICHIESTA!$C$142:$C$241,0))*D236*($A$1=\"S\")","v":0}]
[{"$f":"RICHIESTA!C199","v":58},"UNITA IMMOBILIARE 58",null,1,{"$f":"INDEX(RICHIESTA!$X$142:$X$241,MATCH(A86,RICHIESTA!$C$142:$C$241,0))","v":0},{"$f":"INDEX(RICHIESTA!$BB$142:$BB$241,MATCH(A237,RICHIESTA!$C$142:$C$241,0))*D237*($A$1=\"S\")","v":0},{"$f":"INDEX(RICHIESTA!$BE$142:$BE$241,MATCH(A237,RICHIESTA!$C$142:$C$241,0))*D237*($A$1=\"S\")","v":0}]
[{"$f":"RICHIESTA!C200","v":59},"UNITA IMMOBILIARE 59",null,1,{"$f":"INDEX(RICHIESTA!$X$142:$X$241,MATCH(A87,RICHIESTA!$C$142:$C$241,0))","v":0},{"$f":"INDEX(RICHIESTA!$BB$142:$BB$241,MATCH(A238,RICHIESTA!$C$142:$C$241,0))*D238*($A$1=\"S\")","v":0},{"$f":"INDEX(RICHIESTA!$BE$142:$BE$241,MATCH(A238,RICHIESTA!$C$142:$C$241,0))*D238*($A$1=\"S\")","v":0}]
[{"$f":"RICHIESTA!C201","v":60},"UNITA IMMOBILIARE 60",null,1,{"$f":"INDEX(RICHIESTA!$X$142:$X$241,MATCH(A88,RICHIESTA!$C$142:$C$241,0))","v":0},{"$f":"INDEX(RICHIESTA!$BB$142:$BB$241,MATCH(A239,RICHIESTA!$C$142:$C$241,0))*D239*($A$1=\"S\")","v":0},{"$f":"INDEX(RICHIESTA!$BE$142:$BE$241,MATCH(A239,RICHIESTA!$C$142:$C$241,0))*D239*($A$1=\"S\")","v":0}]
[{"$f":"RICHIESTA!C202","v":61},"UNITA IMMOBILIARE 61",null,1,{"$f":"INDEX(RICHIESTA!$X$142:$X$241,MATCH(A89,RICHIESTA!$C$142:$C$241,0))","v":0},{"$f":"INDEX(RICHIESTA!$BB$142:$BB$241,MATCH(A240,RICHIESTA!$C$142:$C$241,0))*D240*($A$1=\"S\")","v":0},{"$f":"INDEX(RICHIESTA!$BE$142:$BE$241,MATCH(A240,RICHIESTA!$C$142:$C$241,0))*D240*($A$1=\"S\")","v":0}]
[{"$f":"RICHIESTA!C203","v":62},"UNITA IMMOBILIARE 62",null,1,{"$f":"INDEX(RICHIESTA!$X$142:$X$241,MATCH(A90,RICHIESTA!$C$142:$C$241,0))","v":0},{"$f":"INDEX(RICHIESTA!$BB$142:$BB$241,MATCH(A241,RICHIESTA!$C$142:$C$241,0))*D241*($A$1=\"S\")","v":0},{"$f":"INDEX(RICHIESTA!$BE$142:$BE$241,MATCH(A241,RICHIESTA!$C$142:$C$241,0))*D241*($A$1=\"S\")","v":0}]
[{"$f":"RICHIESTA!C204","v":63},"UNITA IMMOBILIARE 63",null,1,{"$f":"INDEX(RICHIESTA!$X$142:$X$241,MATCH(A91,RICHIESTA!$C$142:$C$241,0))","v":0},{"$f":"INDEX(RICHIESTA!$BB$142:$BB$241,MATCH(A242,RICHIESTA!$C$142:$C$241,0))*D242*($A$1=\"S\")","v":0},{"$f":"INDEX(RICHIESTA!$BE$142:$BE$241,MATCH(A242,RICHIESTA!$C$142:$C$241,0))*D242*($A$1=\"S\")","v":0}]
[{"$f":"RICHIESTA!C205","v":64},"UNITA IMMOBILIARE 64",null,1,{"$f":"INDEX(RICHIESTA!$X$142:$X$241,MATCH(A92,RICHIESTA!$C$142:$C$241,0))","v":0},{"$f":"INDEX(RICHIESTA!$BB$142:$BB$241,MATCH(A243,RICHIESTA!$C$142:$C$241,0))*D243*($A$1=\"S\")","v":0},{"$f":"INDEX(RICHIESTA!$BE$142:$BE$241,MATCH(A243,RICHIESTA!$C$142:$C$241,0))*D243*($A$1=\"S\")","v":0}]
[{"$f":"RICHIESTA!C206","v":65},"UNITA IMMOBILIARE 65",null,1,{"$f":"INDEX(RICHIESTA!$X$142:$X$241,MATCH(A93,RICHIESTA!$C$142:$C$241,0))","v":0},{"$f":"INDEX(RICHIESTA!$BB$142:$BB$241,MATCH(A244,RICHIESTA!$C$142:$C$241,0))*D244*($A$1=\"S\")","v":0},{"$f":"INDEX(RICHIESTA!$BE$142:$BE$241,MATCH(A244,RICHIESTA!$C$142:$C$241,0))*D244*($A$1=\"S\")","v":0}]
[{"$f":"RICHIESTA!C207","v":66},{"$f":"\"UNITA IMMOBILIARE \"&A245","v":"UNITA IMMOBILIARE 66"},null,1,{"$f":"INDEX(RICHIESTA!$X$142:$X$241,MATCH(A94,RICHIESTA!$C$142:$C$241,0))","v":0},{"$f":"INDEX(RICHIESTA!$BB$142:$BB$241,MATCH(A245,RICHIESTA!$C$142:$C$241,0))*D245*($A$1=\"S\")","v":0},{"$f":"INDEX(RICHIESTA!$BE$142:$BE$241,MATCH(A245,RICHIESTA!$C$142:$C$241,0))*D245*($A$1=\"S\")","v":0}]
[{"$f":"RICHIESTA!C208","v":67},"UNITA IMMOBILIARE 67",null,1,{"$f":"INDEX(RICHIESTA!$X$142:$X$241,MATCH(A95,RICHIESTA!$C$142:$C$241,0))","v":0},{"$f":"INDEX(RICHIESTA!$BB$142:$BB$241,MATCH(A246,RICHIESTA!$C$142:$C$241,0))*D246*($A$1=\"S\")","v":0},{"$f":"INDEX(RICHIESTA!$BE$142:$BE$241,MATCH(A246,RICHIESTA!$C$142:$C$241,0))*D246*($A$1=\"S\")","v":0}]
[{"$f":"RICHIESTA!C209","v":68},"UNITA IMMOBILIARE 68",null,1,{"$f":"INDEX(RICHIESTA!$X$142:$X$241,MATCH(A96,RICHIESTA!$C$142:$C$241,0))","v":0},{"$f":"INDEX(RICHIESTA!$BB$142:$BB$241,MATCH(A247,RICHIESTA!$C$142:$C$241,0))*D247*($A$1=\"S\")","v":0},{"$f":"INDEX(RICHIESTA!$BE$142:$BE$241,MATCH(A247,RICHIESTA!$C$142:$C$241,0))*D247*($A$1=\"S\")","v":0}]
[{"$f":"RICHIESTA!C210","v":69},"UNITA IMMOBILIARE 69",null,1,{"$f":"INDEX(RICHIESTA!$X$142:$X$241,MATCH(A97,RICHIESTA!$C$142:$C$241,0))","v":0},{"$f":"INDEX(RICHIESTA!$BB$142:$BB$241,MATCH(A248,RICHIESTA!$C$142:$C$241,0))*D248*($A$1=\"S\")","v":0},{"$f":"INDEX(RICHIESTA!$BE$142:$BE$241,MATCH(A248,RICHIESTA!$C$142:$C$241,0))*D248*($A$1=\"S\")","v":0}]
[{"$f":"RICHIESTA!C211","v":70},"UNITA IMMOBILIARE 70",null,1,{"$f":"INDEX(RICHIESTA!$X$142:$X$241,MATCH(A98,RICHIESTA!$C$142:$C$241,0))","v":0},{"$f":"INDEX(RICHIESTA!$BB$142:$BB$241,MATCH(A249,RICHIESTA!$C$142:$C$241,0))*D249*($A$1=\"S\")","v":0},{"$f":"INDEX(RICHIESTA!$BE$142:$BE$241,MATCH(A249,RICHIESTA!$C$142:$C$241,0))*D249*($A$1=\"S\")","v":0}]
[{"$f":"RICHIESTA!C212","v":71},"UNITA IMMOBILIARE 71",null,1,{"$f":"INDEX(RICHIESTA!$X$142:$X$241,MATCH(A99,RICHIESTA!$C$142:$C$241,0))","v":0},{"$f":"INDEX(RICHIESTA!$BB$142:$BB$241,MATCH(A250,RICHIESTA!$C$142:$C$241,0))*D250*($A$1=\"S\")","v":0},{"$f":"INDEX(RICHIESTA!$BE$142:$BE$241,MATCH(A250,RICHIESTA!$C$142:$C$241,0))*D250*($A$1=\"S\")","v":0}]
[{"$f":"RICHIESTA!C213","v":72},"UNITA IMMOBILIARE 72",null,1,{"$f":"INDEX(RICHIESTA!$X$142:$X$241,MATCH(A100,RICHIESTA!$C$142:$C$241,0))","v":0},{"$f":"INDEX(RICHIESTA!$BB$142:$BB$241,MATCH(A251,RICHIESTA!$C$142:$C$241,0))*D251*($A$1=\"S\")","v":0},{"$f":"INDEX(RICHIESTA!$BE$142:$BE$241,MATCH(A251,RICHIESTA!$C$142:$C$241,0))*D251*($A$1=\"S\")","v":0}]
[{"$f":"RICHIESTA!C214","v":73},"UNITA IMMOBILIARE 73",null,1,{"$f":"INDEX(RICHIESTA!$X$142:$X$241,MATCH(A101,RICHIESTA!$C$142:$C$241,0))","v":0},{"$f":"INDEX(RICHIESTA!$BB$142:$BB$241,MATCH(A252,RICHIESTA!$C$142:$C$241,0))*D252*($A$1=\"S\")","v":0},{"$f":"INDEX(RICHIESTA!$BE$142:$BE$241,MATCH(A252,RICHIESTA!$C$142:$C$241,0))*D252*($A$1=\"S\")","v":0}]
[{"$f":"RICHIESTA!C215","v":74},"UNITA IMMOBILIARE 74",null,1,{"$f":"INDEX(RICHIESTA!$X$142:$X$241,MATCH(A102,RICHIESTA!$C$142:$C$241,0))","v":0},{"$f":"INDEX(RICHIESTA!$BB$142:$BB$241,MATCH(A253,RICHIESTA!$C$142:$C$241,0))*D253*($A$1=\"S\")","v":0},{"$f":"INDEX(RICHIESTA!$BE$142:$BE$241,MATCH(A253,RICHIESTA!$C$142:$C$241,0))*D253*($A$1=\"S\")","v":0}]
[{"$f":"RICHIESTA!C216","v":75},"UNITA IMMOBILIARE 75",null,1,{"$f":"INDEX(RICHIESTA!$X$142:$X$241,MATCH(A103,RICHIESTA!$C$142:$C$241,0))","v":0},{"$f":"INDEX(RICHIESTA!$BB$142:$BB$241,MATCH(A254,RICHIESTA!$C$142:$C$241,0))*D254*($A$1=\"S\")","v":0},{"$f":"INDEX(RICHIESTA!$BE$142:$BE$241,MATCH(A254,RICHIESTA!$C$142:$C$241,0))*D254*($A$1=\"S\")","v":0}]
[{"$f":"RICHIESTA!C217","v":76},"UNITA IMMOBILIARE 76",null,1,{"$f":"INDEX(RICHIESTA!$X$142:$X$241,MATCH(A104,RICHIESTA!$C$142:$C$241,0))","v":0},{"$f":"INDEX(RICHIESTA!$BB$142:$BB$241,MATCH(A255,RICHIESTA!$C$142:$C$241,0))*D255*($A$1=\"S\")","v":0},{"$f":"INDEX(RICHIESTA!$BE$142:$BE$241,MATCH(A255,RICHIESTA!$C$142:$C$241,0))*D255*($A$1=\"S\")","v":0}]
[{"$f":"RICHIESTA!C218","v":77},"UNITA IMMOBILIARE 77",null,1,{"$f":"INDEX(RICHIESTA!$X$142:$X$241,MATCH(A105,RICHIESTA!$C$142:$C$241,0))","v":0},{"$f":"INDEX(RICHIESTA!$BB$142:$BB$241,MATCH(A256,RICHIESTA!$C$142:$C$241,0))*D256*($A$1=\"S\")","v":0},{"$f":"INDEX(RICHIESTA!$BE$142:$BE$241,MATCH(A256,RICHIESTA!$C$142:$C$241,0))*D256*($A$1=\"S\")","v":0}]
[{"$f":"RICHIESTA!C219","v":78},"UNITA IMMOBILIARE 78",null,1,{"$f":"INDEX(RICHIESTA!$X$142:$X$241,MATCH(A106,RICHIESTA!$C$142:$C$241,0))","v":0},{"$f":"INDEX(RICHIESTA!$BB$142:$BB$241,MATCH(A257,RICHIESTA!$C$142:$C$241,0))*D257*($A$1=\"S\")","v":0},{"$f":"INDEX(RICHIESTA!$BE$142:$BE$241,MATCH(A257,RICHIESTA!$C$142:$C$241,0))*D257*($A$1=\"S\")","v":0}]
[{"$f":"RICHIESTA!C220","v":79},"UNITA IMMOBILIARE 79",null,1,{"$f":"INDEX(RICHIESTA!$X$142:$X$241,MATCH(A107,RICHIESTA!$C$142:$C$241,0))","v":0},{"$f":"INDEX(RICHIESTA!$BB$142:$BB$241,MATCH(A258,RICHIESTA!$C$142:$C$241,0))*D258*($A$1=\"S\")","v":0},{"$f":"INDEX(RICHIESTA!$BE$142:$BE$241,MATCH(A258,RICHIESTA!$C$142:$C$241,0))*D258*($A$1=\"S\")","v":0}]
[{"$f":"RICHIESTA!C221","v":80},"UNITA IMMOBILIARE 80",null,1,{"$f":"INDEX(RICHIESTA!$X$142:$X$241,MATCH(A108,RICHIESTA!$C$142:$C$241,0))","v":0},{"$f":"INDEX(RICHIESTA!$BB$142:$BB$241,MATCH(A259,RICHIESTA!$C$142:$C$241,0))*D259*($A$1=\"S\")","v":0},{"$f":"INDEX(RICHIESTA!$BE$142:$BE$241,MATCH(A259,RICHIESTA!$C$142:$C$241,0))*D259*($A$1=\"S\")","v":0}]
[{"$f":"RICHIESTA!C222","v":81},"UNITA IMMOBILIARE 81",null,1,{"$f":"INDEX(RICHIESTA!$X$142:$X$241,MATCH(A109,RICHIESTA!$C$142:$C$241,0))","v":0},{"$f":"INDEX(RICHIESTA!$BB$142:$BB$241,MATCH(A260,RICHIESTA!$C$142:$C$241,0))*D260*($A$1=\"S\")","v":0},{"$f":"INDEX(RICHIESTA!$BE$142:$BE$241,MATCH(A260,RICHIESTA!$C$142:$C$241,0))*D260*($A$1=\"S\")","v":0}]
[{"$f":"RICHIESTA!C223","v":82},"UNITA IMMOBILIARE 82",null,1,{"$f":"INDEX(RICHIESTA!$X$142:$X$241,MATCH(A110,RICHIESTA!$C$142:$C$241,0))","v":0},{"$f":"INDEX(RICHIESTA!$BB$142:$BB$241,MATCH(A261,RICHIESTA!$C$142:$C$241,0))*D261*($A$1=\"S\")","v":0},{"$f":"INDEX(RICHIESTA!$BE$142:$BE$241,MATCH(A261,RICHIESTA!$C$142:$C$241,0))*D261*($A$1=\"S\")","v":0}]
[{"$f":"RICHIESTA!C224","v":83},"UNITA IMMOBILIARE 83",null,1,{"$f":"INDEX(RICHIESTA!$X$142:$X$241,MATCH(A111,RICHIESTA!$C$142:$C$241,0))","v":0},{"$f":"INDEX(RICHIESTA!$BB$142:$BB$241,MATCH(A262,RICHIESTA!$C$142:$C$241,0))*D262*($A$1=\"S\")","v":0},{"$f":"INDEX(RICHIESTA!$BE$142:$BE$241,MATCH(A262,RICHIESTA!$C$142:$C$241,0))*D262*($A$1=\"S\")","v":0}]
[{"$f":"RICHIESTA!C225","v":84},"UNITA IMMOBILIARE 84",null,1,{"$f":"INDEX(RICHIESTA!$X$142:$X$241,MATCH(A112,RICHIESTA!$C$142:$C$241,0))","v":0},{"$f":"INDEX(RICHIESTA!$BB$142:$BB$241,MATCH(A263,RICHIESTA!$C$142:$C$241,0))*D263*($A$1=\"S\")","v":0},{"$f":"INDEX(RICHIESTA!$BE$142:$BE$241,MATCH(A263,RICHIESTA!$C$142:$C$241,0))*D263*($A$1=\"S\")","v":0}]
[{"$f":"RICHIESTA!C226","v":85},"UNITA IMMOBILIARE 85",null,1,{"$f":"INDEX(RICHIESTA!$X$142:$X$241,MATCH(A113,RICHIESTA!$C$142:$C$241,0))","v":0},{"$f":"INDEX(RICHIESTA!$BB$142:$BB$241,MATCH(A264,RICHIESTA!$C$142:$C$241,0))*D264*($A$1=\"S\")","v":0},{"$f":"INDEX(RICHIESTA!$BE$142:$BE$241,MATCH(A264,RICHIESTA!$C$142:$C$241,0))*D264*($A$1=\"S\")","v":0}]
[{"$f":"RICHIESTA!C227","v":86},"UNITA IMMOBILIARE 86",null,1,{"$f":"INDEX(RICHIESTA!$X$142:$X$241,MATCH(A114,RICHIESTA!$C$142:$C$241,0))","v":0},{"$f":"INDEX(RICHIESTA!$BB$142:$BB$241,MATCH(A265,RICHIESTA!$C$142:$C$241,0))*D265*($A$1=\"S\")","v":0},{"$f":"INDEX(RICHIESTA!$BE$142:$BE$241,MATCH(A265,RICHIESTA!$C$142:$C$241,0))*D265*($A$1=\"S\")","v":0}]
[{"$f":"RICHIESTA!C228","v":87},"UNITA IMMOBILIARE 87",null,1,{"$f":"INDEX(RICHIESTA!$X$142:$X$241,MATCH(A115,RICHIESTA!$C$142:$C$241,0))","v":0},{"$f":"INDEX(RICHIESTA!$BB$142:$BB$241,MATCH(A266,RICHIESTA!$C$142:$C$241,0))*D266*($A$1=\"S\")","v":0},{"$f":"INDEX(RICHIESTA!$BE$142:$BE$241,MATCH(A266,RICHIESTA!$C$142:$C$241,0))*D266*($A$1=\"S\")","v":0}]
[{"$f":"RICHIESTA!C229","v":88},"UNITA IMMOBILIARE 88",null,1,{"$f":"INDEX(RICHIESTA!$X$142:$X$241,MATCH(A116,RICHIESTA!$C$142:$C$241,0))","v":0},{"$f":"INDEX(RICHIESTA!$BB$142:$BB$241,MATCH(A267,RICHIESTA!$C$142:$C$241,0))*D267*($A$1=\"S\")","v":0},{"$f":"INDEX(RICHIESTA!$BE$142:$BE$241,MATCH(A267,RICHIESTA!$C$142:$C$241,0))*D267*($A$1=\"S\")","v":0}]
[{"$f":"RICHIESTA!C230","v":89},"UNITA IMMOBILIARE 89",null,1,{"$f":"INDEX(RICHIESTA!$X$142:$X$241,MATCH(A117,RICHIESTA!$C$142:$C$241,0))","v":0},{"$f":"INDEX(RICHIESTA!$BB$142:$BB$241,MATCH(A268,RICHIESTA!$C$142:$C$241,0))*D268*($A$1=\"S\")","v":0},{"$f":"INDEX(RICHIESTA!$BE$142:$BE$241,MATCH(A268,RICHIESTA!$C$142:$C$241,0))*D268*($A$1=\"S\")","v":0}]
[{"$f":"RICHIESTA!C231","v":90},"UNITA IMMOBILIARE 90",null,1,{"$f":"INDEX(RICHIESTA!$X$142:$X$241,MATCH(A118,RICHIESTA!$C$142:$C$241,0))","v":0},{"$f":"INDEX(RICHIESTA!$BB$142:$BB$241,MATCH(A269,RICHIESTA!$C$142:$C$241,0))*D269*($A$1=\"S\")","v":0},{"$f":"INDEX(RICHIESTA!$BE$142:$BE$241,MATCH(A269,RICHIESTA!$C$142:$C$241,0))*D269*($A$1=\"S\")","v":0}]
[{"$f":"RICHIESTA!C232","v":91},"UNITA IMMOBILIARE 91",null,1,{"$f":"INDEX(RICHIESTA!$X$142:$X$241,MATCH(A119,RICHIESTA!$C$142:$C$241,0))","v":0},{"$f":"INDEX(RICHIESTA!$BB$142:$BB$241,MATCH(A270,RICHIESTA!$C$142:$C$241,0))*D270*($A$1=\"S\")","v":0},{"$f":"INDEX(RICHIESTA!$BE$142:$BE$241,MATCH(A270,RICHIESTA!$C$142:$C$241,0))*D270*($A$1=\"S\")","v":0}]
[{"$f":"RICHIESTA!C233","v":92},"UNITA IMMOBILIARE 92",null,1,{"$f":"INDEX(RICHIESTA!$X$142:$X$241,MATCH(A120,RICHIESTA!$C$142:$C$241,0))","v":0},{"$f":"INDEX(RICHIESTA!$BB$142:$BB$241,MATCH(A271,RICHIESTA!$C$142:$C$241,0))*D271*($A$1=\"S\")","v":0},{"$f":"INDEX(RICHIESTA!$BE$142:$BE$241,MATCH(A271,RICHIESTA!$C$142:$C$241,0))*D271*($A$1=\"S\")","v":0}]
[{"$f":"RICHIESTA!C234","v":93},"UNITA IMMOBILIARE 93",null,1,{"$f":"INDEX(RICHIESTA!$X$142:$X$241,MATCH(A121,RICHIESTA!$C$142:$C$241,0))","v":0},{"$f":"INDEX(RICHIESTA!$BB$142:$BB$241,MATCH(A272,RICHIESTA!$C$142:$C$241,0))*D272*($A$1=\"S\")","v":0},{"$f":"INDEX(RICHIESTA!$BE$142:$BE$241,MATCH(A272,RICHIESTA!$C$142:$C$241,0))*D272*($A$1=\"S\")","v":0}]
[{"$f":"RICHIESTA!C235","v":94},"UNITA IMMOBILIARE 94",null,1,{"$f":"INDEX(RICHIESTA!$X$142:$X$241,MATCH(A122,RICHIESTA!$C$142:$C$241,0))","v":0},{"$f":"INDEX(RICHIESTA!$BB$142:$BB$241,MATCH(A273,RICHIESTA!$C$142:$C$241,0))*D273*($A$1=\"S\")","v":0},{"$f":"INDEX(RICHIESTA!$BE$142:$BE$241,MATCH(A273,RICHIESTA!$C$142:$C$241,0))*D273*($A$1=\"S\")","v":0}]
[{"$f":"RICHIESTA!C236","v":95},"UNITA IMMOBILIARE 95",null,1,{"$f":"INDEX(RICHIESTA!$X$142:$X$241,MATCH(A123,RICHIESTA!$C$142:$C$241,0))","v":0},{"$f":"INDEX(RICHIESTA!$BB$142:$BB$241,MATCH(A274,RICHIESTA!$C$142:$C$241,0))*D274*($A$1=\"S\")","v":0},{"$f":"INDEX(RICHIESTA!$BE$142:$BE$241,MATCH(A274,RICHIESTA!$C$142:$C$241,0))*D274*($A$1=\"S\")","v":0}]
[{"$f":"RICHIESTA!C237","v":96},"UNITA IMMOBILIARE 96",null,1,{"$f":"INDEX(RICHIESTA!$X$142:$X$241,MATCH(A124,RICHIESTA!$C$142:$C$241,0))","v":0},{"$f":"INDEX(RICHIESTA!$BB$142:$BB$241,MATCH(A275,RICHIESTA!$C$142:$C$241,0))*D275*($A$1=\"S\")","v":0},{"$f":"INDEX(RICHIESTA!$BE$142:$BE$241,MATCH(A275,RICHIESTA!$C$142:$C$241,0))*D275*($A$1=\"S\")","v":0}]
[{"$f":"RICHIESTA!C238","v":97},"UNITA IMMOBILIARE 97",null,1,{"$f":"INDEX(RICHIESTA!$X$142:$X$241,MATCH(A125,RICHIESTA!$C$142:$C$241,0))","v":0},{"$f":"INDEX(RICHIESTA!$BB$142:$BB$241,MATCH(A276,RICHIESTA!$C$142:$C$241,0))*D276*($A$1=\"S\")","v":0},{"$f":"INDEX(RICHIESTA!$BE$142:$BE$241,MATCH(A276,RICHIESTA!$C$142:$C$241,0))*D276*($A$1=\"S\")","v":0}]
[{"$f":"RICHIESTA!C239","v":98},"UNITA IMMOBILIARE 98",null,1,{"$f":"INDEX(RICHIESTA!$X$142:$X$241,MATCH(A126,RICHIESTA!$C$142:$C$241,0))","v":0},{"$f":"INDEX(RICHIESTA!$BB$142:$BB$241,MATCH(A277,RICHIESTA!$C$142:$C$241,0))*D277*($A$1=\"S\")","v":0},{"$f":"INDEX(RICHIESTA!$BE$142:$BE$241,MATCH(A277,RICHIESTA!$C$142:$C$241,0))*D277*($A$1=\"S\")","v":0}]
[{"$f":"RICHIESTA!C240","v":99},"UNITA IMMOBILIARE 99",null,1,{"$f":"INDEX(RICHIESTA!$X$142:$X$241,MATCH(A127,RICHIESTA!$C$142:$C$241,0))","v":0},{"$f":"INDEX(RICHIESTA!$BB$142:$BB$241,MATCH(A278,RICHIESTA!$C$142:$C$241,0))*D278*($A$1=\"S\")","v":0},{"$f":"INDEX(RICHIESTA!$BE$142:$BE$241,MATCH(A278,RICHIESTA!$C$142:$C$241,0))*D278*($A$1=\"S\")","v":0}]
[{"$f":"RICHIESTA!C241","v":100},"UNITA IMMOBILIARE 100",null,1,{"$f":"INDEX(RICHIESTA!$X$142:$X$241,MATCH(A128,RICHIESTA!$C$142:$C$241,0))","v":0},{"$f":"INDEX(RICHIESTA!$BB$142:$BB$241,MATCH(A279,RICHIESTA!$C$142:$C$241,0))*D279*($A$1=\"S\")","v":0},{"$f":"INDEX(RICHIESTA!$BE$142:$BE$241,MATCH(A279,RICHIESTA!$C$142:$C$241,0))*D279*($A$1=\"S\")","v":0}]
[null,null,null,1,"TOTALE",{"$f":"SUM(F179:F279)","v":0},{"$f":"SUM(G179:G279)","v":0}]

{"sheet":"CostoParametrico","index":2,"n_rows":167,"n_cols":13,"rows_kept":167,"cut":false,"hidden":true,"merged":[]}
["Costo parametrico"]
[null,"Destinazione","Livello","IdParametrico","Gradino1","Gradino2","Gradino3","Gradino4","Costo1","Costo2","Costo3","Costo4"]
[null,"Demolizione",null,{"$f":"B3","v":"Demolizione"},1000000000,1000000000,1000000000,1000000000,80,80,80,80]
[null,"Produttiva","L0",{"$f":"B4&\"-\"&C4","v":"Produttiva-L0"},1000,2000,5000,1000000000,100,80,70,60]
[null,"Produttiva","L1",{"$f":"B5&\"-\"&C5","v":"Produttiva-L1"},1000,2000,5000,1000000000,300,270,250,230]
[null,"Produttiva","L2","Produttiva-L2",1000,2000,5000,1000000000,350,320,300,280]
[null,"Produttiva","L3","Produttiva-L3",1000,2000,5000,1000000000,420,390,340,305]
[null,"Produttiva","L4",{"$f":"B8&\"-\"&C8","v":"Produttiva-L4"},1000,2000,5000,1000000000,530,500,450,410]
[null,"Abitativa","L0",{"$f":"B9&\"-\"&C9","v":"Abitativa-L0"},130,220,1000000000,1000000000,400,330,300,300]
[null,"Abitativa","L1","Abitativa-L1",130,220,1000000000,1000000000,850,750,650,650]
[null,"Abitativa","L2","Abitativa-L2",130,220,1000000000,1000000000,1100,900,800,800]
[null,"Abitativa","L3","Abitativa-L3",130,220,1000000000,1000000000,1250,1100,950,950]
[null,"Abitativa","L4","Abitativa-L4",130,220,1000000000,1000000000,1450,1250,1100,1100]
[null,"Ricettiva","L0","Ricettiva-L0",1000000000,1000000000,1000000000,1000000000,400,400,400,400]
[null,"Ricettiva","L1","Ricettiva-L1",1000000000,1000000000,1000000000,1000000000,850,850,850,850]
[null,"Ricettiva","L2","Ricettiva-L2",1000000000,1000000000,1000000000,1000000000,1100,1100,1100,1100]
[null,"Ricettiva","L3","Ricettiva-L3",1000000000,1000000000,1000000000,1000000000,1250,1250,1250,1250]
[null,"Ricettiva","L4","Ricettiva-L4",1000000000,1000000000,1000000000,1000000000,1450,1450,1450,1450]
[]
["Instabilità dinamica"]
[null,"Destinazione","Livello","Ricostruzione","IdParametrico","Gradino1","Gradino2","Gradino3","Gradino4","M1","M2","M3","M4"]
[null,"Produttiva","L0","N",{"$f":"B22&\"-\"&C22&\"-\"&D22","v":"Produttiva-L0-N"},0,0.25,0.35,0.45,0,0,0,0]
[null,"Produttiva","L1","N",{"$f":"B23&\"-\"&C23&\"-\"&D23","v":"Produttiva-L1-N"},0,0.25,0.35,0.45,0,0.05,0.1,0.15]
[null,"Produttiva","L2","N","Produttiva-L2-N",0,0.25,0.35,0.45,0,0.05,0.1,0.15]
[null,"Produttiva","L3","N","Produttiva-L3-N",0,0.25,0.35,0.45,0,0.05,0.1,0.15]
[null,"Produttiva","L4","N",{"$f":"B26&\"-\"&C26&\"-\"&D26","v":"Produttiva-L4-N"},0,0.25,0.35,0.45,0,0.05,0.1,0.15]
[null,"Abitativa","L0","N",{"$f":"B27&\"-\"&C27&\"-\"&D27","v":"Abitativa-L0-N"},0,0.25,0.35,0.45,0,0,0,0]
[null,"Abitativa","L1","N","Abitativa-L1-N",0,0.25,0.35,0.45,0,0.05,0.1,0.15]
[null,"Abitativa","L2","N","Abitativa-L2-N",0,0.25,0.35,0.45,0,0.05,0.1,0.15]
[null,"Abitativa","L3","N","Abitativa-L3-N",0,0.25,0.35,0.45,0,0.05,0.1,0.15]
[null,"Abitativa","L4","N","Abitativa-L4-N",0,0.25,0.35,0.45,0,0.05,0.1,0.15]
[null,"Ricettiva","L0","N","Ricettiva-L0-N",0,0.25,0.35,0.45,0,0,0,0]
[null,"Ricettiva","L1","N","Ricettiva-L1-N",0,0.25,0.35,0.45,0,0.05,0.1,0.15]
[null,"Ricettiva","L2","N","Ricettiva-L2-N",0,0.25,0.35,0.45,0,0.05,0.1,0.15]
[null,"Ricettiva","L3","N","Ricettiva-L3-N",0,0.25,0.35,0.45,0,0.05,0.1,0.15]
[null,"Ricettiva","L4","N","Ricettiva-L4-N",0,0.25,0.35,0.45,0,0.05,0.1,0.15]
[null,"Produttiva","L0","S","Produttiva-L0-S",0,0.25,0.35,0.45,0,0,0,0]
[null,"Produttiva","L1","S","Produttiva-L1-S",0,0.25,0.35,0.45,0,0.05,0.1,0.15]
[null,"Produttiva","L2","S","Produttiva-L2-S",0,0.25,0.35,0.45,0,0.05,0.1,0.15]
[null,"Produttiva","L3","S","Produttiva-L3-S",0,0.25,0.35,0.45,0,0.05,0.1,0.15]
[null,"Produttiva","L4","S","Produttiva-L4-S",0,0.25,0.35,0.45,0,0.05,0.1,0.15]
[null,"Abitativa","L0","S","Abitativa-L0-S",0,0.25,0.35,0.45,0,0,0,0]
[null,"Abitativa","L1","S","Abitativa-L1-S",0,0.25,0.35,0.45,0,0.02,0.04,0.06]
[null,"Abitativa","L2","S","Abitativa-L2-S",0,0.25,0.35,0.45,0,0.02,0.04,0.06]
[null,"Abitativa","L3","S","Abitativa-L3-S",0,0.25,0.35,0.45,0,0.02,0.04,0.06]
[null,"Abitativa","L4","S","Abitativa-L4-S",0,0.25,0.35,0.45,0,0.02,0.04,0.06]
[null,"Ricettiva","L0","S","Ricettiva-L0-S",0,0.25,0.35,0.45,0,0,0,0]
[null,"Ricettiva","L1","S","Ricettiva-L1-S",0,0.25,0.35,0.45,0,0.02,0.04,0.06]
[null,"Ricettiva","L2","S","Ricettiva-L2-S",0,0.25,0.35,0.45,0,0.02,0.04,0.06]
[null,"Ricettiva","L3","S","Ricettiva-L3-S",0,0.25,0.35,0.45,0,0.02,0.04,0.06]
[null,"Ricettiva","L4","S","Ricettiva-L4-S",0,0.25,0.35,0.45,0,0.02,0.04,0.06]
[{"$f":"INDEX(J52:M52,1,E53)","v":0},{"$f":"RICHIESTA!E$20","v":"Abitativa"},{"$f":"RICHIESTA!E$23","v":"L0"},{"$f":"RICHIESTA!E$24","v":"N"},{"$f":"MATCH(B52&\"-\"&C52&\"-\"&D52,E22:E51,0)","v":6},{"$f":"INDEX(F22:F51,$E52)","v":0},0.25,0.35,0.45,0,0,0,0]
[null,{"$f":"RICHIESTA!E73","v":0},null,null,{"$f":"MATCH(B53,F52:I52,1)","v":1}]
[]
["Indagini geognostiche"]
[null,"Destinazione","Superficie TOT",null,null,"Gradino1","Gradino2","Gradino3","Gradino4","M1","M2","M3","M4"]
[null,"Produttiva",null,null,null,1000,2000,1000000000,1000000000,1.7999999999999999E-2,1.2999999999999999E-2,0.01,0.01]
[null,"Abitativa",null,null,null,0,1000000000,1000000000,1000000000,0,0,0,0]
[null,"Ricettiva",null,null,null,0,1000000000,1000000000,1000000000,0,0,0,0]
[{"$f":"(J60*J61+K60*K61+L60*L61+M60*M61)/MAX(C60,1)","v":0},{"$f":"RICHIESTA!E$20","v":"Abitativa"},{"$f":"SUM(RICHIESTA!L140:O140)","v":1E-13},{"$f":"IF(ISERROR(MATCH(C60,F60:I60,1)),1,MATCH(C60,F60:I60,1))","v":1},{"$f":"MATCH(B60,B57:B59,0)","v":2},{"$f":"INDEX(F57:F59,$E60)","v":0},1000000000,1000000000,1000000000,0,0,0,0]
[null,null,null,null,null,null,null,null,null,{"$f":"MIN($C60,F60)","v":0},{"$f":"MAX(0,(MIN($C60,G60)-F60))","v":1E-13},{"$f":"MAX(0,(MIN($C60,H60)-G60))*K60","v":0},{"$f":"MAX(0,(MIN($C60,I60)-H60))*L60","v":0}]
[]
[]
["Distanza tra edifici"]
[null,"Destinazione","Maggiorazione"]
[null,"Produttiva",0]
[null,"Abitativa",0.1]
[null,"Ricettiva",0.1]
[{"$f":"C69","v":0.1},{"$f":"RICHIESTA!E$20","v":"Abitativa"},{"$f":"INDEX(C66:C68,MATCH(B69,B66:B68,0))","v":0.1}]
[]
[]
["Smaltimento crolli"]
[null,"Destinazione","25% +","50% +"]
[null,"Produttiva",0.05,0.1]
[null,"Abitativa",0.05,0.1]
[null,"Ricettiva",0.05,0.1]
[{"$f":"IF(A78,MAX(IF(C78=\"N\",0,C77),IF(D78=\"N\",0,D77)),0)","v":0},{"$f":"RICHIESTA!E$20","v":"Abitativa"},{"$f":"INDEX(C74:C76,MATCH(B77,B74:B76,0))","v":0.05},{"$f":"INDEX(D74:D76,MATCH(C77,C74:C76,0))","v":0.1},"DEMOLIZIONE"]
[{"$f":"IF(B78=\"L0\",FALSE,IF(AND(NOT(B78=\"L4\"),E78),FALSE,TRUE))","v":false},{"$f":"RICHIESTA!E$23","v":"L0"},{"$f":"RICHIESTA!E77","v":"N"},{"$f":"RICHIESTA!E78","v":"N"},false]
[]
[]
[]
["Edifici uni-bifamiliari"]
[null,"Destinazione","Livello","Ricostruzione","IdParametrico","Maggiorazione"]
[null,"Abitativa","L4","S",{"$f":"B84&\"-\"&C84&\"-\"&D84","v":"Abitativa-L4-S"},0.2]
[{"$f":"F85","v":0},null,null,null,{"$f":"RICHIESTA!E$20&\"-\"&RICHIESTA!E23&\"-\"&RICHIESTA!E24","v":"Abitativa-L0-N"},{"$f":"IF(E85=E84,F84,0)","v":0}]
[]
[]
[]
["Accessibilità disabili + Murature spesse"]
[null,"Destinazione","Intervento","Combinato","Accessibilità Disabili","Murature spesse"]
[null,"Produttiva","Rafforzamento",{"$f":"B91&\"-\"&C91","v":"Produttiva-Rafforzamento"},0,0]
[null,"Produttiva","Miglioram",{"$f":"B92&\"-\"&C92","v":"Produttiva-Miglioram"},0,0]
[null,"Produttiva","Adeguamento","Produttiva-Adeguamento",0,0]
[null,"Produttiva","Ricostruzione","Produttiva-Ricostruzione",0,0]
[null,"Produttiva","Acquisto","Produttiva-Acquisto",0,0]
[null,"Abitativa","Rafforzamento","Abitativa-Rafforzamento",0,0]
[null,"Abitativa","Miglioram","Abitativa-Miglioram",0.03,0.02]
[null,"Abitativa","Adeguamento","Abitativa-Adeguamento",0.03,0.02]
[null,"Abitativa","Ricostruzione","Abitativa-Ricostruzione",0,0]
[null,"Abitativa","Acquisto","Abitativa-Acquisto",0,0]
[null,"Ricettiva","Rafforzamento","Ricettiva-Rafforzamento",0,0]
[null,"Ricettiva","Miglioram","Ricettiva-Miglioram",0,0.02]
[null,"Ricettiva","Adeguamento","Ricettiva-Adeguamento",0,0.02]
[null,"Ricettiva","Ricostruzione","Ricettiva-Ricostruzione",0,0]
[null,"Ricettiva","Acquisto","Ricettiva-Acquisto",0,0]
[{"$f":"E106","v":0},{"$f":"RICHIESTA!E$20","v":"Abitativa"},{"$f":"RICHIESTA!E$22","v":"Rafforzamento"},{"$f":"MATCH(B106&\"-\"&C106,D91:D105,0)","v":6},{"$f":"INDEX(E91:E105,$D106)","v":0},{"$f":"INDEX(F91:F105,$D106)","v":0}]
[{"$f":"F106","v":0}]
[]
[]
["Altezza sotto trave"]
[null,"Destinazione","Altezza","Maggiorazione"]
[null,"Produttiva",null,0.1]
[{"$f":"D113","v":0},{"$f":"RICHIESTA!E$20","v":"Abitativa"},{"$f":"RICHIESTA!E82","v":"N"},{"$f":"IF(AND(C113=\"S\",B113=B112),D112,0)","v":0}]
[]
[]
[]
["Vincoli"]
[null,"Destinazione","Livello","Ricostruzione","IdParametrico","Part II","art 136","art 142","art 45"]
[null,"Produttiva","L0","N",{"$f":"B119&\"-\"&C119&\"-\"&D119","v":"Produttiva-L0-N"},0,0,0,0]
[null,"Produttiva","L1","N",{"$f":"B120&\"-\"&C120&\"-\"&D120","v":"Produttiva-L1-N"},0.15,0.1,0,0]
[null,"Produttiva","L2","N","Produttiva-L2-N",0.15,0.1,0,0]
[null,"Produttiva","L3","N","Produttiva-L3-N",0.15,0.1,0,0]
[null,"Produttiva","L4","N",{"$f":"B123&\"-\"&C123&\"-\"&D123","v":"Produttiva-L4-N"},0.15,0.1,0,0]
[null,"Abitativa","L0","N",{"$f":"B124&\"-\"&C124&\"-\"&D124","v":"Abitativa-L0-N"},0.2,0.1,0.1,0]
[null,"Abitativa","L1","N","Abitativa-L1-N",0.4,0.1,0.1,0.2]
[null,"Abitativa","L2","N","Abitativa-L2-N",0.4,0.1,0.1,0.2]
[null,"Abitativa","L3","N","Abitativa-L3-N",0.4,0.1,0.1,0.2]
[null,"Abitativa","L4","N","Abitativa-L4-N",0.4,0.1,0.1,0.2]
[null,"Ricettiva","L0","N","Ricettiva-L0-N",0.2,0.2,0.1,0]
[null,"Ricettiva","L1","N","Ricettiva-L1-N",0.4,0.1,0.1,0.2]
[null,"Ricettiva","L2","N","Ricettiva-L2-N",0.4,0.1,0.1,0.2]
[null,"Ricettiva","L3","N","Ricettiva-L3-N",0.4,0.1,0.1,0.2]
[null,"Ricettiva","L4","N","Ricettiva-L4-N",0.4,0.1,0.1,0.2]
[null,"Produttiva","L0","S","Produttiva-L0-S",0,0,0,0]
[null,"Produttiva","L1","S","Produttiva-L1-S",0,0,0,0]
[null,"Produttiva","L2","S","Produttiva-L2-S",0,0,0,0]
[null,"Produttiva","L3","S","Produttiva-L3-S",0,0,0,0]
[null,"Produttiva","L4","S","Produttiva-L4-S",0,0,0,0]
[null,"Abitativa","L0","S","Abitativa-L0-S",0,0,0,0]
[null,"Abitativa","L1","S","Abitativa-L1-S",0,0,0,0]
[null,"Abitativa","L2","S","Abitativa-L2-S",0,0,0,0]
[null,"Abitativa","L3","S","Abitativa-L3-S",0,0,0,0]
[null,"Abitativa","L4","S","Abitativa-L4-S",0,0,0,0]
[null,"Ricettiva","L0","S","Ricettiva-L0-S",0,0,0,0]
[null,"Ricettiva","L1","S","Ricettiva-L1-S",0,0,0,0]
[null,"Ricettiva","L2","S","Ricettiva-L2-S",0,0,0,0]
[null,"Ricettiva","L3","S","Ricettiva-L3-S",0,0,0,0]
[null,"Ricettiva","L4","S","Ricettiva-L4-S",0,0,0,0]
[null,{"$f":"RICHIESTA!E$20","v":"Abitativa"},{"$f":"RICHIESTA!E$23","v":"L0"},{"$f":"RICHIESTA!E24","v":"N"},{"$f":"MATCH(B149&\"-\"&C149&\"-\"&D149,E119:E148,0)","v":6},{"$f":"INDEX(F119:F148,$E149)","v":0.2},{"$f":"INDEX(G119:G148,$E149)","v":0.1},{"$f":"INDEX(H119:H148,$E149)","v":0.1},{"$f":"INDEX(I119:I148,$E149)","v":0}]
[]
["Altitudine"]
[null,"Destinazione","700m +","1000m +"]
[null,"Produttiva",0.05,0.1]
[null,"Abitativa",0.02,0.03]
[null,"Ricettiva",0.02,0.03]
[{"$f":"IF(B157=\"L0\",0,MAX(IF(C157=\"N\",0,C156),IF(D157=\"N\",0,D156)))","v":0},{"$f":"RICHIESTA!E$20","v":"Abitativa"},{"$f":"INDEX(C153:C155,MATCH(B156,B153:B155,0))","v":0.02},{"$f":"INDEX(D153:D155,MATCH(C156,C153:C155,0))","v":0.03}]
[null,{"$f":"RICHIESTA!E$23","v":"L0"},{"$f":"RICHIESTA!E87","v":"N"},{"$f":"RICHIESTA!E88","v":"N"}]
[]
[]
[]
["Cemento-Amianto"]
[null,"Destinazione","20% +","50% +"]
[null,"Produttiva",0.05,0.15]
[null,"Abitativa",0.05,0.1]
[null,"Ricettiva",0.05,0.1]
[{"$f":"IF(B167=\"L0\",0,MAX(IF(C167=\"N\",0,C166),IF(D167=\"N\",0,D166)))","v":0},{"$f":"RICHIESTA!E$20","v":"Abitativa"},{"$f":"INDEX(C163:C165,MATCH(B166,B163:B165,0))","v":0.05},{"$f":"INDEX(D163:D165,MATCH(C166,C163:C165,0))","v":0.15}]
[null,{"$f":"RICHIESTA!E$23","v":"L0"},{"$f":"RICHIESTA!E90","v":"N"},{"$f":"RICHIESTA!E91","v":"N"}]

{"sheet":"LookupTable","index":3,"n_rows":1008,"n_cols":50,"rows_kept":1008,"cut":false,"hidden":true,"merged":[]}
["Denominazione in italiano","Provincia","Regione","Cratere","MUDE","Regione","Città Metropolitana","Provincia (1)","Progressivo del Comune (2)","Comune",null,"SI-NO",null,"TipoPersona",null,"ID","Tipo proprietario strutture","Richiedente","PartiComuni",null,"IDIntervento","Intervento","CodInt","Intervento","SAL-INIZ","SAL-INT1","SAL-INT2","SAL-FINE",null,null,"ID","Proprieta",null,"IdLivelloOperativo","Livello operativo",null,"ID","Destinazione prevalente","nome","Struttura",null,"ID","Aggregato",null,"ID","Descrizione","Combinato","Residenziale",null,"VERO-FALSO"]
["Abbateggio","PE","Abruzzo",false,true,13,"-","068","001","068001",null,"S",null,"PF","F",1,"Persona fisica",1,"N",null,25,"Rafforzamento","R","RIPARAZIONE CON RAFFORZAMENTO LOCALE",0.5,0,0,0.5,null,null,0,"Privata",null,6,"L0",null,1,"Abitativa","A","EDIFICIO AD USO ABITATIVO",null,0,"NO",null,"A","Abitativo","A - Abitativo",1,null,true]
["Acciano","AQ","Abruzzo",false,false,13,"-","066","001","066001",null,"N",null,"RS","G",2,"Comunione",1,"N",null,26,"Miglioram","M","RIPARAZIONE CON MIGLIORAMENTO SISMICO",0.2,0.2,0.3,0.3,null,null,1,"Pubblica",null,7,"L1",null,102,"Ricettiva","R","EDIFICIO AD USO NON ABITATIVO",null,1,"Volontario",null,"B","Agricolo","B - Agricolo",0.7,null,false]
["Accumoli","RI","Lazio",true,true,12,"-","057","001","057001",null,null,null,null,null,3,"Condominio di fatto",1,"S",null,27,"Adeguamento","A","RIPARAZIONE CON ADEGUAMENTO SISMICO",0.2,0.2,0.3,0.3,null,null,2,"ONLUS",null,8,"L2",null,3,"Produttiva","P","EDIFICIO AD USO NON ABITATIVO",null,2,"UMI",null,"C","Commercio","C - Commercio",0.7]
["Acquacanina","MC","Marche",true,false,11,"-","043","001","043001",null,null,null,null,null,4,"Condominio registrato",13,"S",null,28,"Ricostruzione","DR","DEMOLIZIONE E RICOSTRUZIONE",0.2,0.2,0.3,0.3,null,null,null,null,null,9,"L3",null,103,"Beni e Scorte","B","BENI E SCORTE",null,null,null,null,"D","Direzionale / Uffici","D - Direzionale / Uffici",0.7]
["Acquafondata","FR","Lazio",false,false,12,"-","060","001","060001",null,null,null,null,null,5,"Persona giuridica",13,"N",null,29,"Acquisto","C","ACQUISTO DI NUOVO IMMOBILE SOSTITUTIVO",0,0,0,1,null,null,null,null,null,10,"L4",null,null,null,null,null,null,null,null,null,"E","Industriale / Artigianale","E - Industriale / Artigianale",0.7]
["Acqualagna","PU","Marche",false,false,11,"-","041","001","041001",null,null,null,null,null,null,null,null,null,null,30,"Demolizione","DC","DEMOLIZIONE",0,0,0,1,null,null,null,null,null,null,null,null,null,null,null,null,null,null,null,null,"F","Servizi Pubblici","F - Servizi Pubblici",0.7]
["Acquapendente","VT","Lazio",false,false,12,"-","056","001","056001",null,null,null,null,null,null,null,null,null,null,null,null,null,null,null,null,null,null,null,null,null,null,null,null,null,null,null,null,null,null,null,null,null,null,"G","Turistico / Ricettivo","G - Turistico / Ricettivo",0.7]
["Acquasanta Terme","AP","Marche",true,true,11,"-","044","001","044001",null,null,null,null,null,null,null,null,null,null,null,null,null,null,null,null,null,null,null,null,null,null,null,null,null,null,null,null,null,null,null,null,null,null,"H","Altro","H - Altro",0.7]
["Acquasparta","TR","Umbria",false,true,10,"-","055","001","055001"]
["Acquaviva Picena","AP","Marche",false,true,11,"-","044","002","044002",null,null,null,null,null,null,null,null,null,null,null,"Rafforzamento","Miglioram","Adeguamento","Ricostruzione","Acquisto","Demolizione"]
["Acuto","FR","Lazio",false,false,12,"-","060","002","060002",null,null,null,null,null,null,null,null,null,null,null,"L0","L1","L4","L1","L4","L4"]
["Affile","RM","Lazio",false,false,12,"258","058","001","058001",null,null,null,null,null,null,null,null,null,null,null,null,"L2",null,"L2"]
["Agosta","RM","Lazio",false,false,12,"258","058","002","058002",null,null,null,null,null,null,null,null,null,null,null,null,"L3",null,"L3"]
["Agugliano","AN","Marche",false,false,11,"-","042","001","042001",null,null,null,null,null,null,null,null,null,null,null,null,null,null,"L4"]
["Aielli","AQ","Abruzzo",false,false,13,"-","066","002","066002"]
["Alanno","PE","Abruzzo",false,true,13,"-","068","002","068002"]
["Alatri","FR","Lazio",false,false,12,"-","060","003","060003",null,null,null,null,null,null,null,null,null,null,null,"Ammessa","Vietata"]
["Alba Adriatica","TE","Abruzzo",false,false,13,"-","067","001","067001",null,null,null,null,null,null,null,null,null,null,null,"S","N"]
["Albano Laziale","RM","Lazio",false,false,12,"258","058","003","058003",null,null,null,null,null,null,null,null,null,null,null,"N"]
["Alfedena","AQ","Abruzzo",false,false,13,"-","066","003","066003"]
["Allerona","TR","Umbria",false,false,10,"-","055","002","055002"]
["Allumiere","RM","Lazio",false,false,12,"258","058","004","058004"]
["Altidona","FM","Marche",false,true,11,"-","109","001","109001"]
["Altino","CH","Abruzzo",false,false,13,"-","069","001","069001"]
["Alviano","TR","Umbria",false,true,10,"-","055","003","055003"]
["Alvito","FR","Lazio",false,false,12,"-","060","004","060004"]
["Amandola","FM","Marche",true,true,11,"-","109","002","109002"]
["Amaseno","FR","Lazio",false,false,12,"-","060","005","060005"]
["Amatrice","RI","Lazio",true,true,12,"-","057","002","057002"]
["Amelia","TR","Umbria",false,true,10,"-","055","004","055004"]
["Anagni","FR","Lazio",false,false,12,"-","060","006","060006"]
["Ancarano","TE","Abruzzo",false,true,13,"-","067","002","067002"]
["Ancona","AN","Marche",false,true,11,"-","042","002","042002"]
["Anguillara Sabazia","RM","Lazio",false,false,12,"258","058","005","058005"]
["Anticoli Corrado","RM","Lazio",false,false,12,"258","058","006","058006"]
["Antrodoco","RI","Lazio",true,true,12,"-","057","003","057003"]
["Anversa degli Abruzzi","AQ","Abruzzo",false,false,13,"-","066","004","066004"]
["Anzio","RM","Lazio",false,false,12,"258","058","007","058007"]
["Apecchio","PU","Marche",false,false,11,"-","041","002","041002"]
["Apiro","MC","Marche",true,true,11,"-","043","002","043002"]
["Appignano","MC","Marche",false,true,11,"-","043","003","043003"]
["Appignano del Tronto","AP","Marche",true,true,11,"-","044","005","044005"]
["Aprilia","LT","Lazio",false,false,12,"-","059","001","059001"]
["Aquino","FR","Lazio",false,false,12,"-","060","007","060007"]
["Arce","FR","Lazio",false,false,12,"-","060","008","060008"]
["Arcevia","AN","Marche",false,true,11,"-","042","003","042003"]
["Archi","CH","Abruzzo",false,false,13,"-","069","002","069002"]
["Arcinazzo Romano","RM","Lazio",false,false,12,"258","058","008","058008"]
["Ardea","RM","Lazio",false,false,12,"258","058","117","058117"]
["Ari","CH","Abruzzo",false,false,13,"-","069","003","069003"]
["Ariccia","RM","Lazio",false,false,12,"258","058","009","058009"]
["Arielli","CH","Abruzzo",false,false,13,"-","069","004","069004"]
["Arlena di Castro","VT","Lazio",false,false,12,"-","056","002","056002"]
["Arnara","FR","Lazio",false,false,12,"-","060","009","060009"]
["Arpino","FR","Lazio",false,false,12,"-","060","010","060010"]
["Arquata del Tronto","AP","Marche",true,true,11,"-","044","006","044006"]
["Arrone","TR","Umbria",true,true,10,"-","055","005","055005"]
["Arsita","TE","Abruzzo",false,true,13,"-","067","003","067003"]
["Arsoli","RM","Lazio",false,false,12,"258","058","010","058010"]
["Artena","RM","Lazio",false,false,12,"258","058","011","058011"]
["Ascoli Piceno","AP","Marche",true,true,11,"-","044","007","044007"]
["Ascrea","RI","Lazio",false,false,12,"-","057","004","057004"]
["Assisi","PG","Umbria",false,true,10,"-","054","001","054001"]
["Ateleta","AQ","Abruzzo",false,false,13,"-","066","005","066005"]
["Atessa","CH","Abruzzo",false,false,13,"-","069","005","069005"]
["Atina","FR","Lazio",false,false,12,"-","060","011","060011"]
["Atri","TE","Abruzzo",false,true,13,"-","067","004","067004"]
["Attigliano","TR","Umbria",false,false,10,"-","055","006","055006"]
["Auditore","PU","Marche",false,false,11,"-","041","003","041003"]
["Ausonia","FR","Lazio",false,false,12,"-","060","012","060012"]
["Avezzano","AQ","Abruzzo",false,false,13,"-","066","006","066006"]
["Avigliano Umbro","TR","Umbria",false,true,10,"-","055","033","055033"]
["Bagnoregio","VT","Lazio",false,false,12,"-","056","003","056003"]
["Balsorano","AQ","Abruzzo",false,false,13,"-","066","007","066007"]
["Barbara","AN","Marche",false,false,11,"-","042","004","042004"]
["Barbarano Romano","VT","Lazio",false,false,12,"-","056","004","056004"]
["Barete","AQ","Abruzzo",true,true,13,"-","066","008","066008"]
["Barisciano","AQ","Abruzzo",false,false,13,"-","066","009","066009"]
["Barrea","AQ","Abruzzo",false,false,13,"-","066","010","066010"]
["Baschi","TR","Umbria",false,true,10,"-","055","007","055007"]
["Basciano","TE","Abruzzo",false,true,13,"-","067","005","067005"]
["Bassano in Teverina","VT","Lazio",false,false,12,"-","056","006","056006"]
["Bassano Romano","VT","Lazio",false,false,12,"-","056","005","056005"]
["Bassiano","LT","Lazio",false,false,12,"-","059","002","059002"]
["Bastia Umbra","PG","Umbria",false,true,10,"-","054","002","054002"]
["Belforte all'Isauro","PU","Marche",false,false,11,"-","041","005","041005"]
["Belforte del Chienti","MC","Marche",true,true,11,"-","043","004","043004"]
["Bellante","TE","Abruzzo",false,true,13,"-","067","006","067006"]
["Bellegra","RM","Lazio",false,false,12,"258","058","012","058012"]
["Belmonte Castello","FR","Lazio",false,false,12,"-","060","013","060013"]
["Belmonte in Sabina","RI","Lazio",false,true,12,"-","057","005","057005"]
["Belmonte Piceno","FM","Marche",true,true,11,"-","109","003","109003"]
["Belvedere Ostrense","AN","Marche",false,false,11,"-","042","005","042005"]
["Bettona","PG","Umbria",false,true,10,"-","054","003","054003"]
["Bevagna","PG","Umbria",false,true,10,"-","054","004","054004"]
["Bisegna","AQ","Abruzzo",false,false,13,"-","066","011","066011"]
["Bisenti","TE","Abruzzo",false,true,13,"-","067","007","067007"]
["Blera","VT","Lazio",false,true,12,"-","056","007","056007"]
["Bolognano","PE","Abruzzo",false,false,13,"-","068","003","068003"]
["Bolognola","MC","Marche",true,true,11,"-","043","005","043005"]
["Bolsena","VT","Lazio",false,false,12,"-","056","008","056008"]
["Bomarzo","VT","Lazio",false,false,12,"-","056","009","056009"]
["Bomba","CH","Abruzzo",false,false,13,"-","069","006","069006"]
["Borbona","RI","Lazio",true,true,12,"-","057","006","057006"]
["Borgo Pace","PU","Marche",false,true,11,"-","041","006","041006"]
["Borgo Velino","RI","Lazio",true,true,12,"-","057","008","057008"]
["Borgorose","RI","Lazio",false,false,12,"-","057","007","057007"]
["Borrello","CH","Abruzzo",false,false,13,"-","069","007","069007"]
["Boville Ernica","FR","Lazio",false,false,12,"-","060","014","060014"]
["Bracciano","RM","Lazio",false,false,12,"258","058","013","058013"]
["Brittoli","PE","Abruzzo",false,false,13,"-","068","004","068004"]
["Broccostella","FR","Lazio",false,false,12,"-","060","015","060015"]
["Bucchianico","CH","Abruzzo",false,false,13,"-","069","008","069008"]
["Bugnara","AQ","Abruzzo",false,false,13,"-","066","012","066012"]
["Bussi sul Tirino","PE","Abruzzo",false,false,13,"-","068","005","068005"]
["Cagli","PU","Marche",false,true,11,"-","041","007","041007"]
["Cagnano Amiterno","AQ","Abruzzo",true,true,13,"-","066","013","066013"]
["Calascio","AQ","Abruzzo",false,true,13,"-","066","014","066014"]
["Calcata","VT","Lazio",false,false,12,"-","056","010","056010"]
["Caldarola","MC","Marche",true,true,11,"-","043","006","043006"]
["Calvi dell'Umbria","TR","Umbria",false,true,10,"-","055","008","055008"]
["Camerano","AN","Marche",false,false,11,"-","042","006","042006"]
["Camerata Nuova","RM","Lazio",false,false,12,"258","058","014","058014"]
["Camerata Picena","AN","Marche",false,false,11,"-","042","007","042007"]
["Camerino","MC","Marche",true,true,11,"-","043","007","043007"]
["Campagnano di Roma","RM","Lazio",false,false,12,"258","058","015","058015"]
["Campello sul Clitunno","PG","Umbria",false,true,10,"-","054","005","054005"]
["Campli","TE","Abruzzo",true,true,13,"-","067","008","067008"]
["Campo di Giove","AQ","Abruzzo",false,false,13,"-","066","015","066015"]
["Campodimele","LT","Lazio",false,false,12,"-","059","003","059003"]
["Campofilone","FM","Marche",false,true,11,"-","109","004","109004"]
["Campoli Appennino","FR","Lazio",false,false,12,"-","060","016","060016"]
["Camporotondo di Fiastrone","MC","Marche",true,true,11,"-","043","008","043008"]
["Campotosto","AQ","Abruzzo",true,true,13,"-","066","016","066016"]
["Canale Monterano","RM","Lazio",false,false,12,"258","058","016","058016"]
["Canepina","VT","Lazio",false,false,12,"-","056","011","056011"]
["Canino","VT","Lazio",false,false,12,"-","056","012","056012"]
["Canistro","AQ","Abruzzo",false,false,13,"-","066","017","066017"]
["Cannara","PG","Umbria",false,true,10,"-","054","006","054006"]
["Canosa Sannita","CH","Abruzzo",false,false,13,"-","069","010","069010"]
["Cansano","AQ","Abruzzo",false,false,13,"-","066","018","066018"]
["Cantalice","RI","Lazio",true,true,12,"-","057","009","057009"]
["Cantalupo in Sabina","RI","Lazio",false,false,12,"-","057","010","057010"]
["Canterano","RM","Lazio",false,false,12,"258","058","017","058017"]
["Cantiano","PU","Marche",false,true,11,"-","041","008","041008"]
["Canzano","TE","Abruzzo",false,true,13,"-","067","009","067009"]
["Capena","RM","Lazio",false,false,12,"258","058","018","058018"]
["Capestrano","AQ","Abruzzo",false,false,13,"-","066","019","066019"]
["Capistrello","AQ","Abruzzo",false,false,13,"-","066","020","066020"]
["Capitignano","AQ","Abruzzo",true,true,13,"-","066","021","066021"]
["Capodimonte","VT","Lazio",false,false,12,"-","056","013","056013"]
["Caporciano","AQ","Abruzzo",false,false,13,"-","066","022","066022"]
["Cappadocia","AQ","Abruzzo",false,false,13,"-","066","023","066023"]
["Cappelle sul Tavo","PE","Abruzzo",false,false,13,"-","068","006","068006"]
["Capranica","VT","Lazio",false,false,12,"-","056","014","056014"]
["Capranica Prenestina","RM","Lazio",false,false,12,"258","058","019","058019"]
["Caprarola","VT","Lazio",false,false,12,"-","056","015","056015"]
["Caramanico Terme","PE","Abruzzo",false,false,13,"-","068","007","068007"]
["Carapelle Calvisio","AQ","Abruzzo",false,false,13,"-","066","024","066024"]
["Carassai","AP","Marche",false,true,11,"-","044","010","044010"]
["Carbognano","VT","Lazio",false,false,12,"-","056","016","056016"]
["Carpegna","PU","Marche",false,true,11,"-","041","009","041009"]
["Carpineto della Nora","PE","Abruzzo",false,false,13,"-","068","008","068008"]
["Carpineto Romano","RM","Lazio",false,false,12,"258","058","020","058020"]
["Carpineto Sinello","CH","Abruzzo",false,false,13,"-","069","011","069011"]
["Carsoli","AQ","Abruzzo",false,false,13,"-","066","025","066025"]
["Cartoceto","PU","Marche",false,false,11,"-","041","010","041010"]
["Carunchio","CH","Abruzzo",false,false,13,"-","069","012","069012"]
["Casacanditella","CH","Abruzzo",false,false,13,"-","069","013","069013"]
["Casalanguida","CH","Abruzzo",false,false,13,"-","069","014","069014"]
["Casalattico","FR","Lazio",false,false,12,"-","060","017","060017"]
["Casalbordino","CH","Abruzzo",false,false,13,"-","069","015","069015"]
["Casalincontrada","CH","Abruzzo",false,false,13,"-","069","016","069016"]
["Casalvieri","FR","Lazio",false,false,12,"-","060","018","060018"]
["Casape","RM","Lazio",false,false,12,"258","058","021","058021"]
["Casaprota","RI","Lazio",false,true,12,"-","057","011","057011"]
["Cascia","PG","Umbria",true,true,10,"-","054","007","054007"]
["Casoli","CH","Abruzzo",false,false,13,"-","069","017","069017"]
["Casperia","RI","Lazio",false,true,12,"-","057","012","057012"]
["Cassino","FR","Lazio",false,false,12,"-","060","019","060019"]
["Castel Castagna","TE","Abruzzo",true,true,13,"-","067","010","067010"]
["Castel del Monte","AQ","Abruzzo",false,true,13,"-","066","026","066026"]
["Castel di Ieri","AQ","Abruzzo",false,false,13,"-","066","027","066027"]
["Castel di Lama","AP","Marche",true,true,11,"-","044","011","044011"]
["Castel di Sangro","AQ","Abruzzo",false,false,13,"-","066","028","066028"]
["Castel di Tora","RI","Lazio",false,false,12,"-","057","013","057013"]
["Castel Frentano","CH","Abruzzo",false,false,13,"-","069","018","069018"]
["Castel Gandolfo","RM","Lazio",false,false,12,"258","058","022","058022"]
["Castel Giorgio","TR","Umbria",false,false,10,"-","055","009","055009"]
["Castel Madama","RM","Lazio",false,false,12,"258","058","023","058023"]
["Castel Ritaldi","PG","Umbria",false,true,10,"-","054","008","054008"]
["Castel San Pietro Romano","RM","Lazio",false,false,12,"258","058","025","058025"]
["Castel Sant'Angelo","RI","Lazio",true,true,12,"-","057","015","057015"]
["Castel Sant'Elia","VT","Lazio",false,false,12,"-","056","017","056017"]
["Castel Viscardo","TR","Umbria",false,false,10,"-","055","010","055010"]
["Castelbellino","AN","Marche",false,false,11,"-","042","008","042008"]
["Castelfidardo","AN","Marche",false,false,11,"-","042","010","042010"]
["Castelforte","LT","Lazio",false,false,12,"-","059","004","059004"]
["Castelguidone","CH","Abruzzo",false,false,13,"-","069","019","069019"]
["Castellafiume","AQ","Abruzzo",false,false,13,"-","066","029","066029"]
["Castellalto","TE","Abruzzo",false,true,13,"-","067","011","067011"]
["Castelleone di Suasa","AN","Marche",false,false,11,"-","042","011","042011"]
["Castelli","TE","Abruzzo",true,true,13,"-","067","012","067012"]
["Castelliri","FR","Lazio",false,false,12,"-","060","020","060020"]
["Castelnuovo di Farfa","RI","Lazio",false,false,12,"-","057","014","057014"]
["Castelnuovo di Porto","RM","Lazio",false,false,12,"258","058","024","058024"]
["Castelnuovo Parano","FR","Lazio",false,false,12,"-","060","021","060021"]
["Castelplanio","AN","Marche",false,false,11,"-","042","012","042012"]
["Castelraimondo","MC","Marche",true,true,11,"-","043","009","043009"]
["Castelsantangelo sul Nera","MC","Marche",true,true,11,"-","043","010","043010"]
["Castelvecchio Calvisio","AQ","Abruzzo",false,false,13,"-","066","030","066030"]
["Castelvecchio Subequo","AQ","Abruzzo",false,false,13,"-","066","031","066031"]
["Castiglione a Casauria","PE","Abruzzo",false,true,13,"-","068","009","068009"]
["Castiglione del Lago","PG","Umbria",false,false,10,"-","054","009","054009"]
["Castiglione in Teverina","VT","Lazio",false,false,12,"-","056","018","056018"]
["Castiglione Messer Marino","CH","Abruzzo",false,false,13,"-","069","020","069020"]
["Castiglione Messer Raimondo","TE","Abruzzo",false,true,13,"-","067","013","067013"]
["Castignano","AP","Marche",true,true,11,"-","044","012","044012"]
["Castilenti","TE","Abruzzo",false,true,13,"-","067","014","067014"]
["Castorano","AP","Marche",true,true,11,"-","044","013","044013"]
["Castro dei Volsci","FR","Lazio",false,false,12,"-","060","023","060023"]
["Castrocielo","FR","Lazio",false,false,12,"-","060","022","060022"]
["Catignano","PE","Abruzzo",false,true,13,"-","068","010","068010"]
["Cave","RM","Lazio",false,false,12,"258","058","026","058026"]
["Ceccano","FR","Lazio",false,false,12,"-","060","024","060024"]
["Celano","AQ","Abruzzo",false,false,13,"-","066","032","066032"]
["Celenza sul Trigno","CH","Abruzzo",false,false,13,"-","069","021","069021"]
["Celleno","VT","Lazio",false,false,12,"-","056","019","056019"]
["Cellere","VT","Lazio",false,false,12,"-","056","020","056020"]
["Cellino Attanasio","TE","Abruzzo",false,true,13,"-","067","015","067015"]
["Cepagatti","PE","Abruzzo",false,false,13,"-","068","011","068011"]
["Ceprano","FR","Lazio",false,false,12,"-","060","025","060025"]
["Cerchio","AQ","Abruzzo",false,false,13,"-","066","033","066033"]
["Cermignano","TE","Abruzzo",false,true,13,"-","067","016","067016"]
["Cerreto d'Esi","AN","Marche",true,true,11,"-","042","013","042013"]
["Cerreto di Spoleto","PG","Umbria",true,true,10,"-","054","010","054010"]
["Cerreto Laziale","RM","Lazio",false,false,12,"258","058","027","058027"]
["Cervara di Roma","RM","Lazio",false,false,12,"258","058","028","058028"]
["Cervaro","FR","Lazio",false,false,12,"-","060","026","060026"]
["Cerveteri","RM","Lazio",false,false,12,"258","058","029","058029"]
["Cessapalombo","MC","Marche",true,true,11,"-","043","011","043011"]
["Chiaravalle","AN","Marche",false,false,11,"-","042","014","042014"]
["Chieti","CH","Abruzzo",false,false,13,"-","069","022","069022"]
["Ciampino","RM","Lazio",false,false,12,"258","058","118","058118"]
["Ciciliano","RM","Lazio",false,false,12,"258","058","030","058030"]
["Cineto Romano","RM","Lazio",false,false,12,"258","058","031","058031"]
["Cingoli","MC","Marche",true,true,11,"-","043","012","043012"]
["Cisterna di Latina","LT","Lazio",false,false,12,"-","059","005","059005"]
["Citerna","PG","Umbria",false,false,10,"-","054","011","054011"]
["Città della Pieve","PG","Umbria",false,false,10,"-","054","012","054012"]
["Città di Castello","PG","Umbria",false,false,10,"-","054","013","054013"]
["Città Sant'Angelo","PE","Abruzzo",false,false,13,"-","068","012","068012"]
["Cittaducale","RI","Lazio",true,true,12,"-","057","016","057016"]
["Cittareale","RI","Lazio",true,true,12,"-","057","017","057017"]
["Civita Castellana","VT","Lazio",false,false,12,"-","056","021","056021"]
["Civita d'Antino","AQ","Abruzzo",false,false,13,"-","066","034","066034"]
["Civitaluparella","CH","Abruzzo",false,false,13,"-","069","023","069023"]
["Civitanova Marche","MC","Marche",false,true,11,"-","043","013","043013"]
["Civitaquana","PE","Abruzzo",false,false,13,"-","068","013","068013"]
["Civitavecchia","RM","Lazio",false,false,12,"258","058","032","058032"]
["Civitella Alfedena","AQ","Abruzzo",false,false,13,"-","066","035","066035"]
["Civitella Casanova","PE","Abruzzo",false,true,13,"-","068","014","068014"]
["Civitella d'Agliano","VT","Lazio",false,false,12,"-","056","022","056022"]
["Civitella del Tronto","TE","Abruzzo",true,true,13,"-","067","017","067017"]
["Civitella Messer Raimondo","CH","Abruzzo",false,false,13,"-","069","024","069024"]
["Civitella Roveto","AQ","Abruzzo",false,false,13,"-","066","036","066036"]
["Civitella San Paolo","RM","Lazio",false,false,12,"258","058","033","058033"]
["Cocullo","AQ","Abruzzo",false,false,13,"-","066","037","066037"]
["Colfelice","FR","Lazio",false,false,12,"-","060","027","060027"]
["Collalto Sabino","RI","Lazio",false,false,12,"-","057","018","057018"]
["Collarmele","AQ","Abruzzo",false,false,13,"-","066","038","066038"]
["Collazzone","PG","Umbria",false,true,10,"-","054","014","054014"]
["Colle di Tora","RI","Lazio",false,false,12,"-","057","019","057019"]
["Colle San Magno","FR","Lazio",false,false,12,"-","060","029","060029"]
["Collecorvino","PE","Abruzzo",false,false,13,"-","068","015","068015"]
["Colledara","TE","Abruzzo",true,true,13,"-","067","018","067018"]
["Colledimacine","CH","Abruzzo",false,false,13,"-","069","025","069025"]
["Colledimezzo","CH","Abruzzo",false,false,13,"-","069","026","069026"]
["Colleferro","RM","Lazio",false,false,12,"258","058","034","058034"]
["Collegiove","RI","Lazio",false,false,12,"-","057","020","057020"]
["Collelongo","AQ","Abruzzo",false,false,13,"-","066","039","066039"]
["Collepardo","FR","Lazio",false,false,12,"-","060","028","060028"]
["Collepietro","AQ","Abruzzo",false,false,13,"-","066","040","066040"]
["Collevecchio","RI","Lazio",false,true,12,"-","057","021","057021"]
["Colli al Metauro","PU","Marche",false,false,11,"-","041","069","041069"]
["Colli del Tronto","AP","Marche",true,true,11,"-","044","014","044014"]
["Colli sul Velino","RI","Lazio",false,true,12,"-","057","022","057022"]
["Colmurano","MC","Marche",true,true,11,"-","043","014","043014"]
["Colonna","RM","Lazio",false,false,12,"258","058","035","058035"]
["Colonnella","TE","Abruzzo",false,true,13,"-","067","019","067019"]
["Comunanza","AP","Marche",true,true,11,"-","044","015","044015"]
["Concerviano","RI","Lazio",false,false,12,"-","057","023","057023"]
["Configni","RI","Lazio",false,false,12,"-","057","024","057024"]
["Contigliano","RI","Lazio",false,true,12,"-","057","025","057025"]
["Controguerra","TE","Abruzzo",false,true,13,"-","067","020","067020"]
["Corchiano","VT","Lazio",false,false,12,"-","056","023","056023"]
["Corciano","PG","Umbria",false,false,10,"-","054","015","054015"]
["Coreno Ausonio","FR","Lazio",false,false,12,"-","060","030","060030"]
["Corfinio","AQ","Abruzzo",false,false,13,"-","066","041","066041"]
["Cori","LT","Lazio",false,false,12,"-","059","006","059006"]
["Corinaldo","AN","Marche",false,false,11,"-","042","015","042015"]
["Corridonia","MC","Marche",true,true,11,"-","043","015","043015"]
["Corropoli","TE","Abruzzo",false,true,13,"-","067","021","067021"]
["Cortino","TE","Abruzzo",true,true,13,"-","067","022","067022"]
["Corvara","PE","Abruzzo",false,false,13,"-","068","016","068016"]
["Cossignano","AP","Marche",true,true,11,"-","044","016","044016"]
["Costacciaro","PG","Umbria",false,true,10,"-","054","016","054016"]
["Cottanello","RI","Lazio",false,true,12,"-","057","026","057026"]
["Crecchio","CH","Abruzzo",false,false,13,"-","069","027","069027"]
["Crognaleto","TE","Abruzzo",true,true,13,"-","067","023","067023"]
["Cugnoli","PE","Abruzzo",false,false,13,"-","068","017","068017"]
["Cupello","CH","Abruzzo",false,false,13,"-","069","028","069028"]
["Cupra Marittima","AP","Marche",false,true,11,"-","044","017","044017"]
["Cupramontana","AN","Marche",false,true,11,"-","042","016","042016"]
["Deruta","PG","Umbria",false,true,10,"-","054","017","054017"]
["Dogliola","CH","Abruzzo",false,false,13,"-","069","029","069029"]
["Elice","PE","Abruzzo",false,false,13,"-","068","018","068018"]
["Esanatoglia","MC","Marche",true,true,11,"-","043","016","043016"]
["Esperia","FR","Lazio",false,false,12,"-","060","031","060031"]
["Fabriano","AN","Marche",true,true,11,"-","042","017","042017"]
["Fabrica di Roma","VT","Lazio",false,false,12,"-","056","024","056024"]
["Fabro","TR","Umbria",false,false,10,"-","055","011","055011"]
["Fagnano Alto","AQ","Abruzzo",false,false,13,"-","066","042","066042"]
["Falconara Marittima","AN","Marche",false,true,11,"-","042","018","042018"]
["Faleria","VT","Lazio",false,false,12,"-","056","025","056025"]
["Falerone","FM","Marche",true,true,11,"-","109","005","109005"]
["Fallo","CH","Abruzzo",false,false,13,"-","069","104","069104"]
["Falvaterra","FR","Lazio",false,false,12,"-","060","032","060032"]
["Fano","PU","Marche",false,true,11,"-","041","013","041013"]
["Fano Adriano","TE","Abruzzo",true,true,13,"-","067","024","067024"]
["Fara Filiorum Petri","CH","Abruzzo",false,false,13,"-","069","030","069030"]
["Fara in Sabina","RI","Lazio",false,false,12,"-","057","027","057027"]
["Fara San Martino","CH","Abruzzo",false,false,13,"-","069","031","069031"]
["Farindola","PE","Abruzzo",true,true,13,"-","068","019","068019"]
["Farnese","VT","Lazio",false,false,12,"-","056","026","056026"]
["Ferentillo","TR","Umbria",true,true,10,"-","055","012","055012"]
["Ferentino","FR","Lazio",false,false,12,"-","060","033","060033"]
["Fermignano","PU","Marche",false,false,11,"-","041","014","041014"]
["Fermo","FM","Marche",false,true,11,"-","109","006","109006"]
["Fiamignano","RI","Lazio",false,true,12,"-","057","028","057028"]
["Fiano Romano","RM","Lazio",false,false,12,"258","058","036","058036"]
["Fiastra","MC","Marche",true,true,11,"-","043","017","043017"]
["Ficulle","TR","Umbria",false,false,10,"-","055","013","055013"]
["Filacciano","RM","Lazio",false,false,12,"258","058","037","058037"]
["Filettino","FR","Lazio",false,false,12,"-","060","034","060034"]
["Filetto","CH","Abruzzo",false,false,13,"-","069","032","069032"]
["Filottrano","AN","Marche",false,true,11,"-","042","019","042019"]
["Fiordimonte","MC","Marche",true,false,11,"-","043","018","043018"]
["Fiuggi","FR","Lazio",false,false,12,"-","060","035","060035"]
["Fiumicino","RM","Lazio",false,false,12,"258","058","120","058120"]
["Fiuminata","MC","Marche",true,true,11,"-","043","019","043019"]
["Folignano","AP","Marche",true,true,11,"-","044","020","044020"]
["Foligno","PG","Umbria",false,true,10,"-","054","018","054018"]
["Fondi","LT","Lazio",false,false,12,"-","059","007","059007"]
["Fontana Liri","FR","Lazio",false,false,12,"-","060","036","060036"]
["Fonte Nuova","RM","Lazio",false,false,12,"258","058","122","058122"]
["Fontecchio","AQ","Abruzzo",false,false,13,"-","066","043","066043"]
["Fontechiari","FR","Lazio",false,false,12,"-","060","037","060037"]
["Forano","RI","Lazio",false,true,12,"-","057","029","057029"]
["Force","AP","Marche",true,true,11,"-","044","021","044021"]
["Formello","RM","Lazio",false,false,12,"258","058","038","058038"]
["Formia","LT","Lazio",false,false,12,"-","059","008","059008"]
["Fossa","AQ","Abruzzo",false,false,13,"-","066","044","066044"]
["Fossacesia","CH","Abruzzo",false,false,13,"-","069","033","069033"]
["Fossato di Vico","PG","Umbria",false,true,10,"-","054","019","054019"]
["Fossombrone","PU","Marche",false,true,11,"-","041","015","041015"]
["Fraine","CH","Abruzzo",false,false,13,"-","069","034","069034"]
["Francavilla al Mare","CH","Abruzzo",false,false,13,"-","069","035","069035"]
["Francavilla d'Ete","FM","Marche",false,true,11,"-","109","007","109007"]
["Frascati","RM","Lazio",false,false,12,"258","058","039","058039"]
["Frasso Sabino","RI","Lazio",false,false,12,"-","057","030","057030"]
["Fratta Todina","PG","Umbria",false,true,10,"-","054","020","054020"]
["Fratte Rosa","PU","Marche",false,true,11,"-","041","016","041016"]
["Fresagrandinaria","CH","Abruzzo",false,false,13,"-","069","036","069036"]
["Frisa","CH","Abruzzo",false,false,13,"-","069","037","069037"]
["Frontino","PU","Marche",false,false,11,"-","041","017","041017"]
["Frontone","PU","Marche",false,true,11,"-","041","018","041018"]
["Frosinone","FR","Lazio",false,false,12,"-","060","038","060038"]
["Fumone","FR","Lazio",false,false,12,"-","060","039","060039"]
["Furci","CH","Abruzzo",false,false,13,"-","069","038","069038"]
["Gabicce Mare","PU","Marche",false,false,11,"-","041","019","041019"]
["Gaeta","LT","Lazio",false,false,12,"-","059","009","059009"]
["Gagliano Aterno","AQ","Abruzzo",false,false,13,"-","066","045","066045"]
["Gagliole","MC","Marche",true,true,11,"-","043","020","043020"]
["Gallese","VT","Lazio",false,false,12,"-","056","027","056027"]
["Gallicano nel Lazio","RM","Lazio",false,false,12,"258","058","040","058040"]
["Gallinaro","FR","Lazio",false,false,12,"-","060","040","060040"]
["Gamberale","CH","Abruzzo",false,false,13,"-","069","039","069039"]
["Gavignano","RM","Lazio",false,false,12,"258","058","041","058041"]
["Genazzano","RM","Lazio",false,false,12,"258","058","042","058042"]
["Genga","AN","Marche",false,true,11,"-","042","020","042020"]
["Genzano di Roma","RM","Lazio",false,false,12,"258","058","043","058043"]
["Gerano","RM","Lazio",false,false,12,"258","058","044","058044"]
["Gessopalena","CH","Abruzzo",false,false,13,"-","069","040","069040"]
["Giano dell'Umbria","PG","Umbria",false,true,10,"-","054","021","054021"]
["Gioia dei Marsi","AQ","Abruzzo",false,false,13,"-","066","046","066046"]
["Giove","TR","Umbria",false,true,10,"-","055","014","055014"]
["Gissi","CH","Abruzzo",false,false,13,"-","069","041","069041"]
["Giuliano di Roma","FR","Lazio",false,false,12,"-","060","041","060041"]
["Giuliano Teatino","CH","Abruzzo",false,false,13,"-","069","042","069042"]
["Giulianova","TE","Abruzzo",false,true,13,"-","067","025","067025"]
["Gorga","RM","Lazio",false,false,12,"258","058","045","058045"]
["Goriano Sicoli","AQ","Abruzzo",false,false,13,"-","066","047","066047"]
["Gradara","PU","Marche",false,false,11,"-","041","020","041020"]
["Gradoli","VT","Lazio",false,false,12,"-","056","028","056028"]
["Graffignano","VT","Lazio",false,false,12,"-","056","029","056029"]
["Greccio","RI","Lazio",false,true,12,"-","057","031","057031"]
["Grottaferrata","RM","Lazio",false,false,12,"258","058","046","058046"]
["Grottammare","AP","Marche",false,true,11,"-","044","023","044023"]
["Grottazzolina","FM","Marche",false,true,11,"-","109","008","109008"]
["Grotte di Castro","VT","Lazio",false,false,12,"-","056","030","056030"]
["Gualdo","MC","Marche",true,true,11,"-","043","021","043021"]
["Gualdo Cattaneo","PG","Umbria",false,true,10,"-","054","022","054022"]
["Gualdo Tadino","PG","Umbria",false,true,10,"-","054","023","054023"]
["Guarcino","FR","Lazio",false,false,12,"-","060","042","060042"]
["Guardea","TR","Umbria",false,true,10,"-","055","015","055015"]
["Guardiagrele","CH","Abruzzo",false,false,13,"-","069","043","069043"]
["Gubbio","PG","Umbria",false,true,10,"-","054","024","054024"]
["Guidonia Montecelio","RM","Lazio",false,false,12,"258","058","047","058047"]
["Guilmi","CH","Abruzzo",false,false,13,"-","069","044","069044"]
["Introdacqua","AQ","Abruzzo",false,true,13,"-","066","048","066048"]
["Ischia di Castro","VT","Lazio",false,false,12,"-","056","031","056031"]
["Isola del Gran Sasso d'Italia","TE","Abruzzo",true,true,13,"-","067","026","067026"]
["Isola del Liri","FR","Lazio",false,false,12,"-","060","043","060043"]
["Isola del Piano","PU","Marche",false,false,11,"-","041","021","041021"]
["Itri","LT","Lazio",false,false,12,"-","059","010","059010"]
["Jenne","RM","Lazio",false,false,12,"258","058","048","058048"]
["Jesi","AN","Marche",false,false,11,"-","042","021","042021"]
["Labico","RM","Lazio",false,false,12,"258","058","049","058049"]
["Labro","RI","Lazio",false,false,12,"-","057","032","057032"]
["Ladispoli","RM","Lazio",false,false,12,"258","058","116","058116"]
["Lama dei Peligni","CH","Abruzzo",false,false,13,"-","069","045","069045"]
["Lanciano","CH","Abruzzo",false,false,13,"-","069","046","069046"]
["Lanuvio","RM","Lazio",false,false,12,"258","058","050","058050"]
["Lapedona","FM","Marche",false,true,11,"-","109","009","109009"]
["L'Aquila","AQ","Abruzzo",false,true,13,"-","066","049","066049"]
["Lariano","RM","Lazio",false,false,12,"258","058","115","058115"]
["Latera","VT","Lazio",false,false,12,"-","056","032","056032"]
["Latina","LT","Lazio",false,false,12,"-","059","011","059011"]
["Lecce nei Marsi","AQ","Abruzzo",false,false,13,"-","066","050","066050"]
["Lenola","LT","Lazio",false,false,12,"-","059","012","059012"]
["Lentella","CH","Abruzzo",false,false,13,"-","069","047","069047"]
["Leonessa","RI","Lazio",true,true,12,"-","057","033","057033"]
["Lettomanoppello","PE","Abruzzo",false,false,13,"-","068","020","068020"]
["Lettopalena","CH","Abruzzo",false,false,13,"-","069","048","069048"]
["Licenza","RM","Lazio",false,false,12,"258","058","051","058051"]
["Liscia","CH","Abruzzo",false,false,13,"-","069","049","069049"]
["Lisciano Niccone","PG","Umbria",false,false,10,"-","054","025","054025"]
["Longone Sabino","RI","Lazio",false,false,12,"-","057","034","057034"]
["Loreto","AN","Marche",false,false,11,"-","042","022","042022"]
["Loreto Aprutino","PE","Abruzzo",false,false,13,"-","068","021","068021"]
["Loro Piceno","MC","Marche",true,true,11,"-","043","022","043022"]
["Lubriano","VT","Lazio",false,false,12,"-","056","033","056033"]
["Luco dei Marsi","AQ","Abruzzo",false,false,13,"-","066","051","066051"]
["Lucoli","AQ","Abruzzo",false,false,13,"-","066","052","066052"]
["Lugnano in Teverina","TR","Umbria",false,true,10,"-","055","016","055016"]
["Lunano","PU","Marche",false,false,11,"-","041","022","041022"]
["Macerata","MC","Marche",true,true,11,"-","043","023","043023"]
["Macerata Feltria","PU","Marche",false,false,11,"-","041","023","041023"]
["Maenza","LT","Lazio",false,false,12,"-","059","013","059013"]
["Magione","PG","Umbria",false,false,10,"-","054","026","054026"]
["Magliano de' Marsi","AQ","Abruzzo",false,false,13,"-","066","053","066053"]
["Magliano di Tenna","FM","Marche",false,true,11,"-","109","010","109010"]
["Magliano Romano","RM","Lazio",false,false,12,"258","058","052","058052"]
["Magliano Sabina","RI","Lazio",false,false,12,"-","057","035","057035"]
["Maiolati Spontini","AN","Marche",false,false,11,"-","042","023","042023"]
["Maltignano","AP","Marche",true,true,11,"-","044","027","044027"]
["Mandela","RM","Lazio",false,false,12,"258","058","053","058053"]
["Manoppello","PE","Abruzzo",false,false,13,"-","068","022","068022"]
["Manziana","RM","Lazio",false,false,12,"258","058","054","058054"]
["Marano Equo","RM","Lazio",false,false,12,"258","058","055","058055"]
["Marcellina","RM","Lazio",false,false,12,"258","058","056","058056"]
["Marcetelli","RI","Lazio",false,false,12,"-","057","036","057036"]
["Marino","RM","Lazio",false,false,12,"258","058","057","058057"]
["Marsciano","PG","Umbria",false,true,10,"-","054","027","054027"]
["Marta","VT","Lazio",false,false,12,"-","056","034","056034"]
["Martinsicuro","TE","Abruzzo",false,false,13,"-","067","047","067047"]
["Massa d'Albe","AQ","Abruzzo",false,false,13,"-","066","054","066054"]
["Massa Fermana","FM","Marche",true,true,11,"-","109","011","109011"]
["Massa Martana","PG","Umbria",false,true,10,"-","054","028","054028"]
["Massignano","AP","Marche",false,true,11,"-","044","029","044029"]
["Matelica","MC","Marche",true,true,11,"-","043","024","043024"]
["Mazzano Romano","RM","Lazio",false,false,12,"258","058","058","058058"]
["Mentana","RM","Lazio",false,false,12,"258","058","059","058059"]
["Mercatello sul Metauro","PU","Marche",false,false,11,"-","041","025","041025"]
["Mercatino Conca","PU","Marche",false,false,11,"-","041","026","041026"]
["Mergo","AN","Marche",false,true,11,"-","042","024","042024"]
["Micigliano","RI","Lazio",true,true,12,"-","057","037","057037"]
["Miglianico","CH","Abruzzo",false,false,13,"-","069","050","069050"]
["Minturno","LT","Lazio",false,false,12,"-","059","014","059014"]
["Mogliano","MC","Marche",true,true,11,"-","043","025","043025"]
["Molina Aterno","AQ","Abruzzo",false,false,13,"-","066","055","066055"]
["Mombaroccio","PU","Marche",false,true,11,"-","041","027","041027"]
["Mompeo","RI","Lazio",false,false,12,"-","057","038","057038"]
["Mondavio","PU","Marche",false,false,11,"-","041","028","041028"]
["Mondolfo","PU","Marche",false,false,11,"-","041","029","041029"]
["Monsampietro Morico","FM","Marche",true,true,11,"-","109","012","109012"]
["Monsampolo del Tronto","AP","Marche",false,true,11,"-","044","031","044031"]
["Monsano","AN","Marche",false,false,11,"-","042","025","042025"]
["Montalto delle Marche","AP","Marche",true,true,11,"-","044","032","044032"]
["Montalto di Castro","VT","Lazio",false,false,12,"-","056","035","056035"]
["Montappone","FM","Marche",true,true,11,"-","109","013","109013"]
["Montasola","RI","Lazio",false,false,12,"-","057","039","057039"]
["Montazzoli","CH","Abruzzo",false,false,13,"-","069","051","069051"]
["Monte Castello di Vibio","PG","Umbria",false,true,10,"-","054","029","054029"]
["Monte Cavallo","MC","Marche",true,true,11,"-","043","027","043027"]
["Monte Cerignone","PU","Marche",false,false,11,"-","041","031","041031"]
["Monte Compatri","RM","Lazio",false,false,12,"258","058","060","058060"]
["Monte Giberto","FM","Marche",false,true,11,"-","109","016","109016"]
["Monte Grimano Terme","PU","Marche",false,false,11,"-","041","035","041035"]
["Monte Porzio","PU","Marche",false,false,11,"-","041","038","041038"]
["Monte Porzio Catone","RM","Lazio",false,false,12,"258","058","064","058064"]
["Monte Rinaldo","FM","Marche",true,true,11,"-","109","021","109021"]
["Monte Roberto","AN","Marche",false,false,11,"-","042","029","042029"]
["Monte Romano","VT","Lazio",false,false,12,"-","056","037","056037"]
["Monte San Biagio","LT","Lazio",false,false,12,"-","059","015","059015"]
["Monte San Giovanni Campano","FR","Lazio",false,false,12,"-","060","044","060044"]
["Monte San Giovanni in Sabina","RI","Lazio",false,false,12,"-","057","043","057043"]
["Monte San Giusto","MC","Marche",false,true,11,"-","043","031","043031"]
["Monte San Martino","MC","Marche",true,true,11,"-","043","032","043032"]
["Monte San Pietrangeli","FM","Marche",false,true,11,"-","109","023","109023"]
["Monte San Vito","AN","Marche",false,false,11,"-","042","030","042030"]
["Monte Santa Maria Tiberina","PG","Umbria",false,true,10,"-","054","032","054032"]
["Monte Urano","FM","Marche",false,true,11,"-","109","024","109024"]
["Monte Vidon Combatte","FM","Marche",false,true,11,"-","109","025","109025"]
["Monte Vidon Corrado","FM","Marche",true,true,11,"-","109","026","109026"]
["Montebello di Bertona","PE","Abruzzo",false,false,13,"-","068","023","068023"]
["Montebello sul Sangro","CH","Abruzzo",false,false,13,"-","069","009","069009"]
["Montebuono","RI","Lazio",false,false,12,"-","057","040","057040"]
["Montecalvo in Foglia","PU","Marche",false,false,11,"-","041","030","041030"]
["Montecarotto","AN","Marche",false,false,11,"-","042","026","042026"]
["Montecassiano","MC","Marche",false,true,11,"-","043","026","043026"]
["Montecastrilli","TR","Umbria",false,true,10,"-","055","017","055017"]
["Montecchio","TR","Umbria",false,true,10,"-","055","018","055018"]
["Monteciccardo","PU","Marche",false,false,11,"-","041","032","041032"]
["Montecopiolo","PU","Marche",false,false,11,"-","041","033","041033"]
["Montecosaro","MC","Marche",false,true,11,"-","043","028","043028"]
["Montedinove","AP","Marche",true,true,11,"-","044","034","044034"]
["Montefalco","PG","Umbria",false,true,10,"-","054","030","054030"]
["Montefalcone Appennino","FM","Marche",true,true,11,"-","109","014","109014"]
["Montefano","MC","Marche",false,true,11,"-","043","029","043029"]
["Montefelcino","PU","Marche",false,true,11,"-","041","034","041034"]
["Monteferrante","CH","Abruzzo",false,false,13,"-","069","052","069052"]
["Montefiascone","VT","Lazio",false,false,12,"-","056","036","056036"]
["Montefino","TE","Abruzzo",false,false,13,"-","067","027","067027"]
["Montefiore dell'Aso","AP","Marche",false,false,11,"-","044","036","044036"]
["Monteflavio","RM","Lazio",false,false,12,"258","058","061","058061"]
["Montefortino","FM","Marche",true,true,11,"-","109","015","109015"]
["Montefranco","TR","Umbria",true,true,10,"-","055","019","055019"]
["Montegabbione","TR","Umbria",false,false,10,"-","055","020","055020"]
["Montegallo","AP","Marche",true,true,11,"-","044","038","044038"]
["Montegiorgio","FM","Marche",true,true,11,"-","109","017","109017"]
["Montegranaro","FM","Marche",false,true,11,"-","109","018","109018"]
["Montelabbate","PU","Marche",false,false,11,"-","041","036","041036"]
["Montelanico","RM","Lazio",false,false,12,"258","058","062","058062"]
["Montelapiano","CH","Abruzzo",false,false,13,"-","069","053","069053"]
["Monteleone di Fermo","FM","Marche",true,true,11,"-","109","019","109019"]
["Monteleone di Spoleto","PG","Umbria",true,true,10,"-","054","031","054031"]
["Monteleone d'Orvieto","TR","Umbria",false,false,10,"-","055","021","055021"]
["Monteleone Sabino","RI","Lazio",false,false,12,"-","057","041","057041"]
["Montelibretti","RM","Lazio",false,false,12,"258","058","063","058063"]
["Montelparo","FM","Marche",true,true,11,"-","109","020","109020"]
["Montelupone","MC","Marche",false,true,11,"-","043","030","043030"]
["Montemarciano","AN","Marche",false,false,11,"-","042","027","042027"]
["Montemonaco","AP","Marche",true,true,11,"-","044","044","044044"]
["Montenero Sabino","RI","Lazio",false,false,12,"-","057","042","057042"]
["Montenerodomo","CH","Abruzzo",false,false,13,"-","069","054","069054"]
["Monteodorisio","CH","Abruzzo",false,false,13,"-","069","055","069055"]
["Monteprandone","AP","Marche",false,false,11,"-","044","045","044045"]
["Montereale","AQ","Abruzzo",true,true,13,"-","066","056","066056"]
["Monterosi","VT","Lazio",false,false,12,"-","056","038","056038"]
["Monterotondo","RM","Lazio",false,false,12,"258","058","065","058065"]
["Monterubbiano","FM","Marche",false,true,11,"-","109","022","109022"]
["Montesilvano","PE","Abruzzo",false,false,13,"-","068","024","068024"]
["Montone","PG","Umbria",false,true,10,"-","054","033","054033"]
["Montopoli di Sabina","RI","Lazio",false,false,12,"-","057","044","057044"]
["Montorio al Vomano","TE","Abruzzo",true,true,13,"-","067","028","067028"]
["Montorio Romano","RM","Lazio",false,false,12,"258","058","066","058066"]
["Montottone","FM","Marche",false,true,11,"-","109","027","109027"]
["Moresco","FM","Marche",false,true,11,"-","109","028","109028"]
["Moricone","RM","Lazio",false,false,12,"258","058","067","058067"]
["Morino","AQ","Abruzzo",false,false,13,"-","066","057","066057"]
["Morlupo","RM","Lazio",false,true,12,"258","058","068","058068"]
["Morolo","FR","Lazio",false,false,12,"-","060","045","060045"]
["Morro d'Alba","AN","Marche",false,false,11,"-","042","031","042031"]
["Morro d'Oro","TE","Abruzzo",false,true,13,"-","067","029","067029"]
["Morro Reatino","RI","Lazio",false,false,12,"-","057","045","057045"]
["Morrovalle","MC","Marche",false,true,11,"-","043","033","043033"]
["Mosciano Sant'Angelo","TE","Abruzzo",false,true,13,"-","067","030","067030"]
["Moscufo","PE","Abruzzo",false,false,13,"-","068","025","068025"]
["Mozzagrogna","CH","Abruzzo",false,false,13,"-","069","056","069056"]
["Muccia","MC","Marche",true,true,11,"-","043","034","043034"]
["Narni","TR","Umbria",false,true,10,"-","055","022","055022"]
["Navelli","AQ","Abruzzo",false,false,13,"-","066","058","066058"]
["Nazzano","RM","Lazio",false,false,12,"258","058","069","058069"]
["Nemi","RM","Lazio",false,false,12,"258","058","070","058070"]
["Nepi","VT","Lazio",false,false,12,"-","056","039","056039"]
["Nereto","TE","Abruzzo",false,true,13,"-","067","031","067031"]
["Nerola","RM","Lazio",false,false,12,"258","058","071","058071"]
["Nespolo","RI","Lazio",false,false,12,"-","057","046","057046"]
["Nettuno","RM","Lazio",false,false,12,"258","058","072","058072"]
["Nocciano","PE","Abruzzo",false,false,13,"-","068","026","068026"]
["Nocera Umbra","PG","Umbria",false,true,10,"-","054","034","054034"]
["Norcia","PG","Umbria",true,true,10,"-","054","035","054035"]
["Norma","LT","Lazio",false,false,12,"-","059","016","059016"]
["Notaresco","TE","Abruzzo",false,true,13,"-","067","032","067032"]
["Numana","AN","Marche",false,false,11,"-","042","032","042032"]
["Ocre","AQ","Abruzzo",false,false,13,"-","066","059","066059"]
["Ofena","AQ","Abruzzo",false,false,13,"-","066","060","066060"]
["Offagna","AN","Marche",false,false,11,"-","042","033","042033"]
["Offida","AP","Marche",true,true,11,"-","044","054","044054"]
["Olevano Romano","RM","Lazio",false,false,12,"258","058","073","058073"]
["Onano","VT","Lazio",false,false,12,"-","056","040","056040"]
["Opi","AQ","Abruzzo",false,false,13,"-","066","061","066061"]
["Oricola","AQ","Abruzzo",false,false,13,"-","066","062","066062"]
["Oriolo Romano","VT","Lazio",false,false,12,"-","056","041","056041"]
["Orsogna","CH","Abruzzo",false,false,13,"-","069","057","069057"]
["Orte","VT","Lazio",false,false,12,"-","056","042","056042"]
["Ortezzano","FM","Marche",true,true,11,"-","109","029","109029"]
["Ortona","CH","Abruzzo",false,false,13,"-","069","058","069058"]
["Ortona dei Marsi","AQ","Abruzzo",false,false,13,"-","066","063","066063"]
["Ortucchio","AQ","Abruzzo",false,false,13,"-","066","064","066064"]
["Orvieto","TR","Umbria",false,false,10,"-","055","023","055023"]
["Orvinio","RI","Lazio",false,false,12,"-","057","047","057047"]
["Osimo","AN","Marche",false,false,11,"-","042","034","042034"]
["Ostra","AN","Marche",false,false,11,"-","042","035","042035"]
["Ostra Vetere","AN","Marche",false,false,11,"-","042","036","042036"]
["Otricoli","TR","Umbria",false,true,10,"-","055","024","055024"]
["Ovindoli","AQ","Abruzzo",false,false,13,"-","066","065","066065"]
["Pacentro","AQ","Abruzzo",false,false,13,"-","066","066","066066"]
["Paciano","PG","Umbria",false,false,10,"-","054","036","054036"]
["Paganico Sabino","RI","Lazio",false,false,12,"-","057","048","057048"]
["Paglieta","CH","Abruzzo",false,false,13,"-","069","059","069059"]
["Palena","CH","Abruzzo",false,false,13,"-","069","060","069060"]
["Palestrina","RM","Lazio",false,false,12,"258","058","074","058074"]
["Paliano","FR","Lazio",false,false,12,"-","060","046","060046"]
["Palmiano","AP","Marche",true,true,11,"-","044","056","044056"]
["Palmoli","CH","Abruzzo",false,false,13,"-","069","061","069061"]
["Palombara Sabina","RM","Lazio",false,false,12,"258","058","075","058075"]
["Palombaro","CH","Abruzzo",false,false,13,"-","069","062","069062"]
["Panicale","PG","Umbria",false,false,10,"-","054","037","054037"]
["Parrano","TR","Umbria",false,false,10,"-","055","025","055025"]
["Passignano sul Trasimeno","PG","Umbria",false,false,10,"-","054","038","054038"]
["Pastena","FR","Lazio",false,false,12,"-","060","047","060047"]
["Patrica","FR","Lazio",false,false,12,"-","060","048","060048"]
["Pedaso","FM","Marche",false,true,11,"-","109","030","109030"]
["Peglio","PU","Marche",false,false,11,"-","041","041","041041"]
["Penna in Teverina","TR","Umbria",false,false,10,"-","055","026","055026"]
["Penna San Giovanni","MC","Marche",true,true,11,"-","043","035","043035"]
["Penna Sant'Andrea","TE","Abruzzo",false,true,13,"-","067","033","067033"]
["Pennadomo","CH","Abruzzo",false,false,13,"-","069","063","069063"]
["Pennapiedimonte","CH","Abruzzo",false,false,13,"-","069","064","069064"]
["Penne","PE","Abruzzo",false,true,13,"-","068","027","068027"]
["Perano","CH","Abruzzo",false,false,13,"-","069","065","069065"]
["Percile","RM","Lazio",false,false,12,"258","058","076","058076"]
["Pereto","AQ","Abruzzo",false,false,13,"-","066","067","066067"]
["Pergola","PU","Marche",false,true,11,"-","041","043","041043"]
["Perugia","PG","Umbria",false,false,10,"-","054","039","054039"]
["Pesaro","PU","Marche",false,false,11,"-","041","044","041044"]
["Pescara","PE","Abruzzo",false,false,13,"-","068","028","068028"]
["Pescasseroli","AQ","Abruzzo",false,false,13,"-","066","068","066068"]
["Pescina","AQ","Abruzzo",false,false,13,"-","066","069","066069"]
["Pescocostanzo","AQ","Abruzzo",false,false,13,"-","066","070","066070"]
["Pescorocchiano","RI","Lazio",false,true,12,"-","057","049","057049"]
["Pescosansonesco","PE","Abruzzo",false,false,13,"-","068","029","068029"]
["Pescosolido","FR","Lazio",false,false,12,"-","060","049","060049"]
["Petrella Salto","RI","Lazio",false,true,12,"-","057","050","057050"]
["Petriano","PU","Marche",false,false,11,"-","041","045","041045"]
["Petriolo","MC","Marche",true,true,11,"-","043","036","043036"]
["Petritoli","FM","Marche",false,true,11,"-","109","031","109031"]
["Pettorano sul Gizio","AQ","Abruzzo",false,false,13,"-","066","071","066071"]
["Piandimeleto","PU","Marche",false,false,11,"-","041","047","041047"]
["Pianella","PE","Abruzzo",false,false,13,"-","068","030","068030"]
["Piansano","VT","Lazio",false,false,12,"-","056","043","056043"]
["Picciano","PE","Abruzzo",false,false,13,"-","068","031","068031"]
["Picinisco","FR","Lazio",false,false,12,"-","060","050","060050"]
["Pico","FR","Lazio",false,false,12,"-","060","051","060051"]
["Piedimonte San Germano","FR","Lazio",false,false,12,"-","060","052","060052"]
["Piegaro","PG","Umbria",false,false,10,"-","054","040","054040"]
["Pietracamela","TE","Abruzzo",true,true,13,"-","067","034","067034"]
["Pietraferrazzana","CH","Abruzzo",false,false,13,"-","069","103","069103"]
["Pietralunga","PG","Umbria",false,true,10,"-","054","041","054041"]
["Pietranico","PE","Abruzzo",false,true,13,"-","068","032","068032"]
["Pietrarubbia","PU","Marche",false,false,11,"-","041","048","041048"]
["Pieve Torina","MC","Marche",true,true,11,"-","043","038","043038"]
["Pievebovigliana","MC","Marche",true,false,11,"-","043","037","043037"]
["Piglio","FR","Lazio",false,false,12,"-","060","053","060053"]
["Pignataro Interamna","FR","Lazio",false,false,12,"-","060","054","060054"]
["Pineto","TE","Abruzzo",false,false,13,"-","067","035","067035"]
["Piobbico","PU","Marche",false,false,11,"-","041","049","041049"]
["Pioraco","MC","Marche",true,true,11,"-","043","039","043039"]
["Pisoniano","RM","Lazio",false,false,12,"258","058","077","058077"]
["Pizzoferrato","CH","Abruzzo",false,false,13,"-","069","066","069066"]
["Pizzoli","AQ","Abruzzo",true,true,13,"-","066","072","066072"]
["Pofi","FR","Lazio",false,false,12,"-","060","055","060055"]
["Poggio Bustone","RI","Lazio",true,true,12,"-","057","051","057051"]
["Poggio Catino","RI","Lazio",false,false,12,"-","057","052","057052"]
["Poggio Mirteto","RI","Lazio",false,true,12,"-","057","053","057053"]
["Poggio Moiano","RI","Lazio",false,true,12,"-","057","054","057054"]
["Poggio Nativo","RI","Lazio",false,true,12,"-","057","055","057055"]
["Poggio Picenze","AQ","Abruzzo",false,false,13,"-","066","073","066073"]
["Poggio San Lorenzo","RI","Lazio",false,false,12,"-","057","056","057056"]
["Poggio San Marcello","AN","Marche",false,true,11,"-","042","037","042037"]
["Poggio San Vicino","MC","Marche",true,true,11,"-","043","040","043040"]
["Poggiodomo","PG","Umbria",true,true,10,"-","054","042","054042"]
["Poggiofiorito","CH","Abruzzo",false,false,13,"-","069","067","069067"]
["Poli","RM","Lazio",false,false,12,"258","058","078","058078"]
["Polino","TR","Umbria",true,true,10,"-","055","027","055027"]
["Pollenza","MC","Marche",true,true,11,"-","043","041","043041"]
["Pollutri","CH","Abruzzo",false,false,13,"-","069","068","069068"]
["Polverigi","AN","Marche",false,true,11,"-","042","038","042038"]
["Pomezia","RM","Lazio",false,false,12,"258","058","079","058079"]
["Pontecorvo","FR","Lazio",false,false,12,"-","060","056","060056"]
["Pontinia","LT","Lazio",false,false,12,"-","059","017","059017"]
["Ponza","LT","Lazio",false,false,12,"-","059","018","059018"]
["Ponzano di Fermo","FM","Marche",false,true,11,"-","109","032","109032"]
["Ponzano Romano","RM","Lazio",false,false,12,"258","058","080","058080"]
["Popoli","PE","Abruzzo",false,false,13,"-","068","033","068033"]
["Porano","TR","Umbria",false,false,10,"-","055","028","055028"]
["Porto Recanati","MC","Marche",false,true,11,"-","043","042","043042"]
["Porto San Giorgio","FM","Marche",false,true,11,"-","109","033","109033"]
["Porto Sant'Elpidio","FM","Marche",false,true,11,"-","109","034","109034"]
["Posta","RI","Lazio",true,true,12,"-","057","057","057057"]
["Posta Fibreno","FR","Lazio",false,false,12,"-","060","057","060057"]
["Potenza Picena","MC","Marche",false,true,11,"-","043","043","043043"]
["Pozzaglia Sabina","RI","Lazio",false,false,12,"-","057","058","057058"]
["Prata d'Ansidonia","AQ","Abruzzo",false,false,13,"-","066","074","066074"]
["Pratola Peligna","AQ","Abruzzo",false,true,13,"-","066","075","066075"]
["Preci","PG","Umbria",true,true,10,"-","054","043","054043"]
["Pretoro","CH","Abruzzo",false,false,13,"-","069","069","069069"]
["Prezza","AQ","Abruzzo",false,false,13,"-","066","076","066076"]
["Priverno","LT","Lazio",false,false,12,"-","059","019","059019"]
["Proceno","VT","Lazio",false,false,12,"-","056","044","056044"]
["Prossedi","LT","Lazio",false,false,12,"-","059","020","059020"]
["Quadri","CH","Abruzzo",false,false,13,"-","069","070","069070"]
["Raiano","AQ","Abruzzo",false,false,13,"-","066","077","066077"]
["Rapagnano","FM","Marche",false,true,11,"-","109","035","109035"]
["Rapino","CH","Abruzzo",false,false,13,"-","069","071","069071"]
["Recanati","MC","Marche",false,true,11,"-","043","044","043044"]
["Riano","RM","Lazio",false,false,12,"258","058","081","058081"]
["Rieti","RI","Lazio",true,true,12,"-","057","059","057059"]
["Rignano Flaminio","RM","Lazio",false,false,12,"258","058","082","058082"]
["Riofreddo","RM","Lazio",false,false,12,"258","058","083","058083"]
["Ripa Teatina","CH","Abruzzo",false,false,13,"-","069","072","069072"]
["Ripatransone","AP","Marche",false,true,11,"-","044","063","044063"]
["Ripe San Ginesio","MC","Marche",true,true,11,"-","043","045","043045"]
["Ripi","FR","Lazio",false,false,12,"-","060","058","060058"]
["Rivisondoli","AQ","Abruzzo",false,false,13,"-","066","078","066078"]
["Rivodutri","RI","Lazio",true,true,12,"-","057","060","057060"]
["Rocca Canterano","RM","Lazio",false,false,12,"258","058","084","058084"]
["Rocca d'Arce","FR","Lazio",false,false,12,"-","060","059","060059"]
["Rocca di Botte","AQ","Abruzzo",false,false,13,"-","066","080","066080"]
["Rocca di Cambio","AQ","Abruzzo",false,false,13,"-","066","081","066081"]
["Rocca di Cave","RM","Lazio",false,false,12,"258","058","085","058085"]
["Rocca di Mezzo","AQ","Abruzzo",false,false,13,"-","066","082","066082"]
["Rocca di Papa","RM","Lazio",false,false,12,"258","058","086","058086"]
["Rocca Massima","LT","Lazio",false,false,12,"-","059","022","059022"]
["Rocca Pia","AQ","Abruzzo",false,false,13,"-","066","083","066083"]
["Rocca Priora","RM","Lazio",false,false,12,"258","058","088","058088"]
["Rocca San Giovanni","CH","Abruzzo",false,false,13,"-","069","074","069074"]
["Rocca Santa Maria","TE","Abruzzo",true,true,13,"-","067","036","067036"]
["Rocca Santo Stefano","RM","Lazio",false,false,12,"258","058","089","058089"]
["Rocca Sinibalda","RI","Lazio",false,true,12,"-","057","062","057062"]
["Roccacasale","AQ","Abruzzo",false,false,13,"-","066","079","066079"]
["Roccafluvione","AP","Marche",true,true,11,"-","044","064","044064"]
["Roccagiovine","RM","Lazio",false,false,12,"258","058","087","058087"]
["Roccagorga","LT","Lazio",false,false,12,"-","059","021","059021"]
["Roccamontepiano","CH","Abruzzo",false,false,13,"-","069","073","069073"]
["Roccamorice","PE","Abruzzo",false,false,13,"-","068","034","068034"]
["Roccantica","RI","Lazio",false,true,12,"-","057","061","057061"]
["Roccaraso","AQ","Abruzzo",false,false,13,"-","066","084","066084"]
["Roccascalegna","CH","Abruzzo",false,false,13,"-","069","075","069075"]
["Roccasecca","FR","Lazio",false,false,12,"-","060","060","060060"]
["Roccasecca dei Volsci","LT","Lazio",false,false,12,"-","059","023","059023"]
["Roccaspinalveti","CH","Abruzzo",false,false,13,"-","069","076","069076"]
["Roiate","RM","Lazio",false,false,12,"258","058","090","058090"]
["Roio del Sangro","CH","Abruzzo",false,false,13,"-","069","077","069077"]
["Roma","RM","Lazio",false,false,12,"258","058","091","058091"]
["Ronciglione","VT","Lazio",false,false,12,"-","056","045","056045"]
["Rosciano","PE","Abruzzo",false,false,13,"-","068","035","068035"]
["Rosello","CH","Abruzzo",false,false,13,"-","069","078","069078"]
["Roseto degli Abruzzi","TE","Abruzzo",false,false,13,"-","067","037","067037"]
["Rosora","AN","Marche",false,true,11,"-","042","040","042040"]
["Rotella","AP","Marche",true,true,11,"-","044","065","044065"]
["Roviano","RM","Lazio",false,false,12,"258","058","092","058092"]
["Sabaudia","LT","Lazio",false,false,12,"-","059","024","059024"]
["Sacrofano","RM","Lazio",false,false,12,"258","058","093","058093"]
["Salisano","RI","Lazio",false,true,12,"-","057","063","057063"]
["Salle","PE","Abruzzo",false,false,13,"-","068","036","068036"]
["Sambuci","RM","Lazio",false,false,12,"258","058","094","058094"]
["San Benedetto dei Marsi","AQ","Abruzzo",false,false,13,"-","066","085","066085"]
["San Benedetto del Tronto","AP","Marche",false,true,11,"-","044","066","044066"]
["San Benedetto in Perillis","AQ","Abruzzo",false,false,13,"-","066","086","066086"]
["San Biagio Saracinisco","FR","Lazio",false,false,12,"-","060","061","060061"]
["San Buono","CH","Abruzzo",false,false,13,"-","069","079","069079"]
["San Cesareo","RM","Lazio",false,false,12,"258","058","119","058119"]
["San Costanzo","PU","Marche",false,false,11,"-","041","051","041051"]
["San Demetrio ne' Vestini","AQ","Abruzzo",false,false,13,"-","066","087","066087"]
["San Donato Val di Comino","FR","Lazio",false,false,12,"-","060","062","060062"]
["San Felice Circeo","LT","Lazio",false,false,12,"-","059","025","059025"]
["San Gemini","TR","Umbria",false,false,10,"-","055","029","055029"]
["San Ginesio","MC","Marche",true,true,11,"-","043","046","043046"]
["San Giorgio a Liri","FR","Lazio",false,false,12,"-","060","063","060063"]
["San Giovanni Incarico","FR","Lazio",false,false,12,"-","060","064","060064"]
["San Giovanni Lipioni","CH","Abruzzo",false,false,13,"-","069","080","069080"]
["San Giovanni Teatino","CH","Abruzzo",false,false,13,"-","069","081","069081"]
["San Giustino","PG","Umbria",false,false,10,"-","054","044","054044"]
["San Gregorio da Sassola","RM","Lazio",false,false,12,"258","058","095","058095"]
["San Lorenzo in Campo","PU","Marche",false,true,11,"-","041","054","041054"]
["San Lorenzo Nuovo","VT","Lazio",false,false,12,"-","056","047","056047"]
["San Marcello","AN","Marche",false,false,11,"-","042","041","042041"]
["San Martino sulla Marrucina","CH","Abruzzo",false,false,13,"-","069","082","069082"]
["San Paolo di Jesi","AN","Marche",false,false,11,"-","042","042","042042"]
["San Pio delle Camere","AQ","Abruzzo",false,false,13,"-","066","088","066088"]
["San Polo dei Cavalieri","RM","Lazio",false,false,12,"258","058","096","058096"]
["San Salvo","CH","Abruzzo",false,false,13,"-","069","083","069083"]
["San Severino Marche","MC","Marche",true,true,11,"-","043","047","043047"]
["San Valentino in Abruzzo Citeriore","PE","Abruzzo",false,false,13,"-","068","038","068038"]
["San Venanzo","TR","Umbria",false,false,10,"-","055","030","055030"]
["San Vincenzo Valle Roveto","AQ","Abruzzo",false,false,13,"-","066","092","066092"]
["San Vito Chietino","CH","Abruzzo",false,false,13,"-","069","086","069086"]
["San Vito Romano","RM","Lazio",false,false,12,"258","058","100","058100"]
["San Vittore del Lazio","FR","Lazio",false,false,12,"-","060","070","060070"]
["Santa Maria Imbaro","CH","Abruzzo",false,false,13,"-","069","084","069084"]
["Santa Maria Nuova","AN","Marche",false,false,11,"-","042","043","042043"]
["Santa Marinella","RM","Lazio",false,false,12,"258","058","097","058097"]
["Santa Vittoria in Matenano","FM","Marche",true,true,11,"-","109","036","109036"]
["Sant'Ambrogio sul Garigliano","FR","Lazio",false,false,12,"-","060","065","060065"]
["Sant'Anatolia di Narco","PG","Umbria",true,true,10,"-","054","045","054045"]
["Sant'Andrea del Garigliano","FR","Lazio",false,false,12,"-","060","066","060066"]
["Sant'Angelo in Pontano","MC","Marche",true,true,11,"-","043","048","043048"]
["Sant'Angelo in Vado","PU","Marche",false,true,11,"-","041","057","041057"]
["Sant'Angelo Romano","RM","Lazio",false,false,12,"258","058","098","058098"]
["Sant'Apollinare","FR","Lazio",false,false,12,"-","060","067","060067"]
["Sante Marie","AQ","Abruzzo",false,false,13,"-","066","089","066089"]
["Sant'Egidio alla Vibrata","TE","Abruzzo",false,true,13,"-","067","038","067038"]
["Sant'Elia Fiumerapido","FR","Lazio",false,false,12,"-","060","068","060068"]
["Sant'Elpidio a Mare","FM","Marche",false,true,11,"-","109","037","109037"]
["Sant'Eufemia a Maiella","PE","Abruzzo",false,false,13,"-","068","037","068037"]
["Sant'Eusanio del Sangro","CH","Abruzzo",false,false,13,"-","069","085","069085"]
["Sant'Eusanio Forconese","AQ","Abruzzo",false,false,13,"-","066","090","066090"]
["Santi Cosma e Damiano","LT","Lazio",false,false,12,"-","059","026","059026"]
["Sant'Ippolito","PU","Marche",false,true,11,"-","041","058","041058"]
["Santo Stefano di Sessanio","AQ","Abruzzo",false,true,13,"-","066","091","066091"]
["Sant'Omero","TE","Abruzzo",false,true,13,"-","067","039","067039"]
["Santopadre","FR","Lazio",false,false,12,"-","060","069","060069"]
["Sant'Oreste","RM","Lazio",false,false,12,"258","058","099","058099"]
["Saracinesco","RM","Lazio",false,false,12,"258","058","101","058101"]
["Sarnano","MC","Marche",true,true,11,"-","043","049","043049"]
["Sassocorvaro","PU","Marche",false,false,11,"-","041","059","041059"]
["Sassofeltrio","PU","Marche",false,false,11,"-","041","060","041060"]
["Sassoferrato","AN","Marche",false,true,11,"-","042","044","042044"]
["Scafa","PE","Abruzzo",false,false,13,"-","068","039","068039"]
["Scandriglia","RI","Lazio",false,false,12,"-","057","064","057064"]
["Scanno","AQ","Abruzzo",false,false,13,"-","066","093","066093"]
["Scerni","CH","Abruzzo",false,false,13,"-","069","087","069087"]
["Scheggia e Pascelupo","PG","Umbria",false,true,10,"-","054","046","054046"]
["Scheggino","PG","Umbria",true,true,10,"-","054","047","054047"]
["Schiavi di Abruzzo","CH","Abruzzo",false,false,13,"-","069","088","069088"]
["Scontrone","AQ","Abruzzo",false,false,13,"-","066","094","066094"]
["Scoppito","AQ","Abruzzo",false,true,13,"-","066","095","066095"]
["Scurcola Marsicana","AQ","Abruzzo",false,false,13,"-","066","096","066096"]
["Secinaro","AQ","Abruzzo",false,false,13,"-","066","097","066097"]
["Sefro","MC","Marche",true,true,11,"-","043","050","043050"]
["Segni","RM","Lazio",false,false,12,"258","058","102","058102"]
["Selci","RI","Lazio",false,false,12,"-","057","065","057065"]
["Sellano","PG","Umbria",true,true,10,"-","054","048","054048"]
["Senigallia","AN","Marche",false,false,11,"-","042","045","042045"]
["Sermoneta","LT","Lazio",false,false,12,"-","059","027","059027"]
["Serra de' Conti","AN","Marche",false,true,11,"-","042","046","042046"]
["Serra San Quirico","AN","Marche",false,true,11,"-","042","047","042047"]
["Serra Sant'Abbondio","PU","Marche",false,true,11,"-","041","061","041061"]
["Serramonacesca","PE","Abruzzo",false,false,13,"-","068","040","068040"]
["Serrapetrona","MC","Marche",true,true,11,"-","043","051","043051"]
["Serravalle di Chienti","MC","Marche",true,true,11,"-","043","052","043052"]
["Serrone","FR","Lazio",false,false,12,"-","060","071","060071"]
["Servigliano","FM","Marche",true,true,11,"-","109","038","109038"]
["Settefrati","FR","Lazio",false,false,12,"-","060","072","060072"]
["Sezze","LT","Lazio",false,false,12,"-","059","028","059028"]
["Sgurgola","FR","Lazio",false,false,12,"-","060","073","060073"]
["Sigillo","PG","Umbria",false,true,10,"-","054","049","054049"]
["Silvi","TE","Abruzzo",false,false,13,"-","067","040","067040"]
["Sirolo","AN","Marche",false,false,11,"-","042","048","042048"]
["Smerillo","FM","Marche",true,true,11,"-","109","039","109039"]
["Sonnino","LT","Lazio",false,false,12,"-","059","029","059029"]
["Sora","FR","Lazio",false,false,12,"-","060","074","060074"]
["Soriano nel Cimino","VT","Lazio",false,false,12,"-","056","048","056048"]
["Spello","PG","Umbria",false,true,10,"-","054","050","054050"]
["Sperlonga","LT","Lazio",false,false,12,"-","059","030","059030"]
["Spigno Saturnia","LT","Lazio",false,false,12,"-","059","031","059031"]
["Spinetoli","AP","Marche",true,true,11,"-","044","071","044071"]
["Spoleto","PG","Umbria",true,true,10,"-","054","051","054051"]
["Spoltore","PE","Abruzzo",false,false,13,"-","068","041","068041"]
["Staffolo","AN","Marche",false,true,11,"-","042","049","042049"]
["Stimigliano","RI","Lazio",false,false,12,"-","057","066","057066"]
["Strangolagalli","FR","Lazio",false,false,12,"-","060","075","060075"]
["Stroncone","TR","Umbria",false,true,10,"-","055","031","055031"]
["Subiaco","RM","Lazio",false,false,12,"258","058","103","058103"]
["Sulmona","AQ","Abruzzo",false,false,13,"-","066","098","066098"]
["Supino","FR","Lazio",false,false,12,"-","060","076","060076"]
["Sutri","VT","Lazio",false,false,12,"-","056","049","056049"]
["Tagliacozzo","AQ","Abruzzo",false,false,13,"-","066","099","066099"]
["Tarano","RI","Lazio",false,true,12,"-","057","067","057067"]
["Taranta Peligna","CH","Abruzzo",false,false,13,"-","069","089","069089"]
["Tarquinia","VT","Lazio",false,false,12,"-","056","050","056050"]
["Tavoleto","PU","Marche",false,false,11,"-","041","064","041064"]
["Tavullia","PU","Marche",false,false,11,"-","041","065","041065"]
["Teramo","TE","Abruzzo",true,true,13,"-","067","041","067041"]
["Terelle","FR","Lazio",false,false,12,"-","060","077","060077"]
["Terni","TR","Umbria",false,true,10,"-","055","032","055032"]
["Terracina","LT","Lazio",false,false,12,"-","059","032","059032"]
["Terre Roveresche","PU","Marche",false,true,11,"-","041","070","041070"]
["Tessennano","VT","Lazio",false,false,12,"-","056","051","056051"]
["Tione degli Abruzzi","AQ","Abruzzo",false,false,13,"-","066","100","066100"]
["Tivoli","RM","Lazio",false,false,12,"258","058","104","058104"]
["Tocco da Casauria","PE","Abruzzo",false,true,13,"-","068","042","068042"]
["Todi","PG","Umbria",false,true,10,"-","054","052","054052"]
["Toffia","RI","Lazio",false,false,12,"-","057","068","057068"]
["Tolentino","MC","Marche",true,true,11,"-","043","053","043053"]
["Tolfa","RM","Lazio",false,false,12,"258","058","105","058105"]
["Tollo","CH","Abruzzo",false,false,13,"-","069","090","069090"]
["Torano Nuovo","TE","Abruzzo",false,true,13,"-","067","042","067042"]
["Torgiano","PG","Umbria",false,true,10,"-","054","053","054053"]
["Torino di Sangro","CH","Abruzzo",false,false,13,"-","069","091","069091"]
["Tornareccio","CH","Abruzzo",false,false,13,"-","069","092","069092"]
["Tornimparte","AQ","Abruzzo",false,false,13,"-","066","101","066101"]
["Torre Cajetani","FR","Lazio",false,false,12,"-","060","078","060078"]
["Torre de' Passeri","PE","Abruzzo",false,true,13,"-","068","043","068043"]
["Torre San Patrizio","FM","Marche",false,true,11,"-","109","040","109040"]
["Torrebruna","CH","Abruzzo",false,false,13,"-","069","093","069093"]
["Torrevecchia Teatina","CH","Abruzzo",false,false,13,"-","069","094","069094"]
["Torri in Sabina","RI","Lazio",false,true,12,"-","057","070","057070"]
["Torrice","FR","Lazio",false,false,12,"-","060","079","060079"]
["Torricella in Sabina","RI","Lazio",false,true,12,"-","057","069","057069"]
["Torricella Peligna","CH","Abruzzo",false,false,13,"-","069","095","069095"]
["Torricella Sicura","TE","Abruzzo",true,true,13,"-","067","043","067043"]
["Torrita Tiberina","RM","Lazio",false,false,12,"258","058","106","058106"]
["Tortoreto","TE","Abruzzo",false,false,13,"-","067","044","067044"]
["Tossicia","TE","Abruzzo",true,true,13,"-","067","045","067045"]
["Trasacco","AQ","Abruzzo",false,false,13,"-","066","102","066102"]
["Trecastelli","AN","Marche",false,false,11,"-","042","050","042050"]
["Treglio","CH","Abruzzo",false,false,13,"-","069","096","069096"]
["Treia","MC","Marche",true,true,11,"-","043","054","043054"]
["Trevi","PG","Umbria",false,true,10,"-","054","054","054054"]
["Trevi nel Lazio","FR","Lazio",false,false,12,"-","060","080","060080"]
["Trevignano Romano","RM","Lazio",false,false,12,"258","058","107","058107"]
["Trivigliano","FR","Lazio",false,false,12,"-","060","081","060081"]
["Tufillo","CH","Abruzzo",false,false,13,"-","069","097","069097"]
["Tuoro sul Trasimeno","PG","Umbria",false,false,10,"-","054","055","054055"]
["Turania","RI","Lazio",false,false,12,"-","057","071","057071"]
["Turrivalignani","PE","Abruzzo",false,false,13,"-","068","044","068044"]
["Tuscania","VT","Lazio",false,false,12,"-","056","052","056052"]
["Umbertide","PG","Umbria",false,false,10,"-","054","056","054056"]
["Urbania","PU","Marche",false,true,11,"-","041","066","041066"]
["Urbino","PU","Marche",false,false,11,"-","041","067","041067"]
["Urbisaglia","MC","Marche",true,true,11,"-","043","055","043055"]
["Ussita","MC","Marche",true,true,11,"-","043","056","043056"]
["Vacone","RI","Lazio",false,true,12,"-","057","072","057072"]
["Vacri","CH","Abruzzo",false,false,13,"-","069","098","069098"]
["Valentano","VT","Lazio",false,false,12,"-","056","053","056053"]
["Valfabbrica","PG","Umbria",false,true,10,"-","054","057","054057"]
["Valfornace","MC","Marche",true,true,11,"-","043","058","043058"]
["Valle Castellana","TE","Abruzzo",true,true,13,"-","067","046","067046"]
["Vallecorsa","FR","Lazio",false,false,12,"-","060","082","060082"]
["Vallefoglia","PU","Marche",false,true,11,"-","041","068","041068"]
["Vallemaio","FR","Lazio",false,false,12,"-","060","083","060083"]
["Vallepietra","RM","Lazio",false,false,12,"258","058","108","058108"]
["Vallerano","VT","Lazio",false,false,12,"-","056","054","056054"]
["Vallerotonda","FR","Lazio",false,false,12,"-","060","084","060084"]
["Vallinfreda","RM","Lazio",false,false,12,"258","058","109","058109"]
["Vallo di Nera","PG","Umbria",true,true,10,"-","054","058","054058"]
["Valmontone","RM","Lazio",false,false,12,"258","058","110","058110"]
["Valtopina","PG","Umbria",false,true,10,"-","054","059","054059"]
["Varco Sabino","RI","Lazio",false,false,12,"-","057","073","057073"]
["Vasanello","VT","Lazio",false,false,12,"-","056","055","056055"]
["Vasto","CH","Abruzzo",false,false,13,"-","069","099","069099"]
["Vejano","VT","Lazio",false,false,12,"-","056","056","056056"]
["Velletri","RM","Lazio",false,false,12,"258","058","111","058111"]
["Venarotta","AP","Marche",true,true,11,"-","044","073","044073"]
["Ventotene","LT","Lazio",false,false,12,"-","059","033","059033"]
["Veroli","FR","Lazio",false,false,12,"-","060","085","060085"]
["Vetralla","VT","Lazio",false,false,12,"-","056","057","056057"]
["Vicalvi","FR","Lazio",false,false,12,"-","060","086","060086"]
["Vico nel Lazio","FR","Lazio",false,false,12,"-","060","087","060087"]
["Vicoli","PE","Abruzzo",false,true,13,"-","068","045","068045"]
["Vicovaro","RM","Lazio",false,false,12,"258","058","112","058112"]
["Vignanello","VT","Lazio",false,false,12,"-","056","058","056058"]
["Villa Celiera","PE","Abruzzo",false,false,13,"-","068","046","068046"]
["Villa Latina","FR","Lazio",false,false,12,"-","060","088","060088"]
["Villa San Giovanni in Tuscia","VT","Lazio",false,false,12,"-","056","046","056046"]
["Villa Santa Lucia","FR","Lazio",false,false,12,"-","060","089","060089"]
["Villa Santa Lucia degli Abruzzi","AQ","Abruzzo",false,false,13,"-","066","104","066104"]
["Villa Santa Maria","CH","Abruzzo",false,false,13,"-","069","102","069102"]
["Villa Sant'Angelo","AQ","Abruzzo",false,false,13,"-","066","105","066105"]
["Villa Santo Stefano","FR","Lazio",false,false,12,"-","060","090","060090"]
["Villalago","AQ","Abruzzo",false,false,13,"-","066","103","066103"]
["Villalfonsina","CH","Abruzzo",false,false,13,"-","069","100","069100"]
["Villamagna","CH","Abruzzo",false,false,13,"-","069","101","069101"]
["Villavallelonga","AQ","Abruzzo",false,false,13,"-","066","106","066106"]
["Villetta Barrea","AQ","Abruzzo",false,false,13,"-","066","107","066107"]
["Visso","MC","Marche",true,true,11,"-","043","057","043057"]
["Viterbo","VT","Lazio",false,false,12,"-","056","059","056059"]
["Viticuso","FR","Lazio",false,false,12,"-","060","091","060091"]
["Vitorchiano","VT","Lazio",false,false,12,"-","056","060","056060"]
["Vittorito","AQ","Abruzzo",false,false,13,"-","066","108","066108"]
["Vivaro Romano","RM","Lazio",false,false,12,"258","058","113","058113"]
["Zagarolo","RM","Lazio",false,false,12,"258","058","114","058114"]

{"sheet":"SpeseTecniche","index":4,"n_rows":64,"n_cols":29,"rows_kept":64,"cut":false,"hidden":true,"merged":[[22,11,22,13],[43,4,43,7],[22,4,22,7],[29,4,29,7],[2,4,2,7],[8,4,8,7],[15,4,15,8],[32,11,32,14]]}
[null,null,{"$f":"RICHIESTA!D22","v":"R"},{"$f":"RICHIESTA!E20","v":"Abitativa"},null,null,null,null,{"$f":"IF(RICHIESTA!D22=\"DC\",0,6000)","v":6000},null,{"$f":"RICHIESTA!$T$103","v":0}]
[null,null,null,null,null,null,null,null,null,null,{"$f":"IF($D$1=\"Produttiva\",$D$12,$D$19)","v":6000}]
[null,null,null,null,"Indagini e prove (art. 7 c. 6)",null,null,null,null,"Perc. Ordinanza","Perc. Richiesta","RICHIESTA",null,null,null,null,null,null,null,null,null,null,null,null,null,null,null,null,"S"]
[null,null,null,"Lavori ammessi",500000,1000000,2000000,"-","Progettazione",0.54,{"$f":"J4+IF(K5>0,0,5%)","v":0.59000000000000008},{"$f":"K$2*K4","v":3540.0000000000005},null,null,null,null,null,null,null,null,null,null,null,null,null,null,null,null,"N"]
[null,null,null,"Percentuale",0.03,1.4999999999999999E-2,7.4999999999999997E-3,3.5000000000000001E-3,"Coord. sicurezza",0.09,{"$f":"IF(SUM(RICHIESTA!M$119:M$120)=0,0,J5)","v":0},{"$f":"K$2*K5","v":0}]
[null,"RICHIESTA",{"$f":"SUM(RICHIESTA!R$106:R$110)","v":1E-10},{"$f":"SUM(E6:H6)","v":3.0000000000000001E-12},{"$f":"MIN(E4,$C6)*E5","v":3.0000000000000001E-12},{"$f":"MAX(0,(MIN($C6,F4)-E4))*F5","v":0},{"$f":"MAX(0,MIN($C6,G4)-F4)*G5","v":0},{"$f":"MAX(0,$C6-G4)*H5","v":0},"Direzione lavori",0.33,{"$f":"J6+IF(K7>0,0,4%)+IF(K5>0,0,4%)","v":0.41},{"$f":"K$2*K6","v":2460}]
[null,null,null,null,null,null,null,null,"Collaudo",0.04,{"$f":"IF(SUM(RICHIESTA!M$123:M$124)=0,0,J7)","v":0},{"$f":"K$2*K7","v":0}]
[null,null,null,null,null,null,null,null,null,{"$f":"SUM(J4:J7)","v":1},{"$f":"SUM(K4:K7)","v":1},{"$f":"SUM(L4:L7)","v":6000}]
[null,null,null,null,"Spese tecniche edifici produttivi (art. 8 c. 3)"]
[null,null,null,"Lavori ammessi",500000,1000000,2000000,"-"]
[null,null,null,"Percentuale",0.115,0.09,0.08,7.0000000000000007E-2]
[null,"RICHIESTA",{"$f":"SUM(RICHIESTA!$R$105:$R$110)","v":1E-10},{"$f":"MAX(I12,SUM(E12:H12))","v":1.1500000000000001E-11},{"$f":"MIN(E$10,$C12)*E$11","v":1.1500000000000001E-11},{"$f":"MAX(0,(MIN($C12,F$10)-E$10))*F$11","v":0},{"$f":"MAX(0,MIN($C12,G$10)-F$10)*G$11","v":0},{"$f":"MAX(0,$C12-G$10)*H$11","v":0},0]
[]
[]
[]
[null,null,null,null,"Spese tecniche edifici residenziali (art. 8 c. 4)"]
[null,null,null,"Lavori ammessi",150000,500000,1000000,2000000,"-"]
[null,null,null,"Percentuale",0.125,0.12,0.1,8.5000000000000006E-2,7.4999999999999997E-2]
[null,"RICHIESTA",{"$f":"C12","v":1E-10},{"$f":"MAX(J19,SUM(E19:I19))","v":6000},{"$f":"MIN(E$17,$C19)*E$18","v":1.25E-11},{"$f":"MAX(0,(MIN($C19,F17)-E17))*F18","v":0},{"$f":"MAX(0,MIN($C19,G17)-F17)*G18","v":0},{"$f":"MAX(0,MIN($C19,H17)-G17)*H18","v":0},{"$f":"MAX(0,$C19-H17)*I18","v":0},{"$f":"IF(C19=0,0,$I$1)","v":6000}]
[]
[]
[]
[null,null,null,null,"Relazione geologica (art. 9 c. 1.a)",null,null,null,null,null,null,"Compilazione AeDES (allegato D residenziale)"]
[null,null,null,"Lavori ammessi",500000,1000000,2000000,"-",null,null,null,"#UI","Isolato","Centro storico"]
[null,null,null,"Percentuale",1.4E-2,0.01,7.0000000000000001E-3,5.0000000000000001E-3,null,null,null,0,0,0]
[{"$f":"RICHIESTA!E135","v":"N"},"RICHIESTA",{"$f":"C19","v":1E-10},{"$f":"H35*$E$32","v":0},{"$f":"MIN(E$24,$C26)*E$25","v":1.4000000000000001E-12},{"$f":"MAX(0,(MIN($C26,F$24)-E$24))*F$25","v":0},{"$f":"MAX(0,MIN($C26,G$24)-F$24)*G$25","v":0},{"$f":"MAX(0,$C26-G$24)*H$25","v":0},1000,null,null,0.1,470,560]
[null,null,null,null,null,null,null,null,null,null,null,2.1,550,660]
[null,null,null,null,null,null,null,null,null,null,null,5.0999999999999996,680,800]
[null,null,null,null,null,null,null,null,null,null,"Edificio contiguo",10.1,820,1000]
[null,null,null,null,"Altre prestazioni specialistiche (art. 9 c. 1.b)",null,null,null,null,{"$f":"IF(K30=\"N\",M30,N30)","v":560},{"$f":"RICHIESTA!H10","v":false},{"$f":"COUNTIF(RICHIESTA!$X$142:$X$241,\">0\")","v":1},{"$f":"INDEX(M$25:M$29,MATCH($L$30,$L$25:$L$29,1))","v":470},{"$f":"INDEX(N$25:N$29,MATCH($L$30,$L$25:$L$29,1))","v":560}]
[]
[null,"RICHIESTA",{"$f":"C26","v":1E-10},{"$f":"SUM(D33:D36)","v":0},{"$f":"MIN(E33:E34)","v":0},"spese specialistiche computate"]
[{"$f":"RICHIESTA!E131","v":"N"},"Accatastamento",4.0000000000000001E-3,{"$f":"IF(A33=\"S\",$C32*C33,0)","v":0},{"$f":"E35+D32","v":0},"TOT spese specialistiche",null,null,null,{"$f":"IF(RICHIESTA!$D$20=\"A\",J30,J40)","v":560},null,"Compilazione AeDES (allegato D produttivo)"]
[{"$f":"RICHIESTA!E132","v":"N"},"Ambientale",4.0000000000000001E-3,{"$f":"IF(A34=\"S\",$C32*C34,0)","v":0},{"$f":"C32*H34","v":2E-12},"MAX spese specialistiche (2%)",null,0.02,null,null,null,"Superficie","Prefabbricata","CA e/o acciaio","Ricettivo"]
[{"$f":"RICHIESTA!E133","v":"N"},"Rilievo GEO",0,{"$f":"IF(A35=\"S\",$C32*C35,0)","v":0},{"$f":"IF(A26=\"N\",0,MIN(C26,MAX(I26,SUM(E26:H26))))","v":0},"REAL spese specialistiche geologiche",null,{"$f":"E35/MAX($E$33,1)","v":0},null,null,null,0,0,0,0]
[{"$f":"RICHIESTA!E134","v":"N"},"Rilievo STORICO",7.0000000000000001E-3,{"$f":"IF(A36=\"S\",$C32*C36,0)","v":0},{"$f":"H36*$E$32","v":0},"REAL altre spese specialistiche",null,{"$f":"D32/MAX($E$33,1)","v":0},null,null,null,1E-3,520,450,620]
[null,null,null,null,null,null,null,null,null,null,null,1000.001,580,500,740]
[null,null,null,null,null,null,null,null,null,null,null,2000.001,640,560,880]
[null,null,null,null,null,null,null,null,null,null,"P-PC-R",4000.0010000000002,750,650,1000]
[null,null,null,null,null,null,null,null,null,{"$f":"INDEX(M40:R40,MATCH(K40,M$41:R$41,0))","v":470},{"$f":"IF(RICHIESTA!E85=\"S\",\"R\",RICHIESTA!D20)&RICHIESTA!E84","v":"AN"},{"$f":"RICHIESTA!$V$140","v":1E-13},{"$f":"INDEX(M$35:M$39,MATCH($L$40,$L$35:$L$39,1))","v":0},{"$f":"INDEX(N$35:N$39,MATCH($L$40,$L$35:$L$39,1))","v":0},{"$f":"INDEX(O$35:O$39,MATCH($L$40,$L$35:$L$39,1))","v":0},{"$f":"INDEX(P$35:P$39,MATCH($L$40,$L$35:$L$39,1))","v":0},{"$f":"M30","v":470},{"$f":"N30","v":560}]
[null,null,null,null,null,null,null,null,null,null,null,"SUP","PN","PS","RN","RS","AN","AS"]
[]
[]
[null,null,null,null,"Amministratori (art. 7 c. 3)"]
[null,null,null,"Lavori ammessi",200000,500000,3000000,"-"]
[null,null,null,"Percentuale",0.02,1.4999999999999999E-2,0.01,5.0000000000000001E-3]
[null,"RICHIESTA",{"$f":"C26","v":1E-10},{"$f":"SUM(E47:H47)","v":2E-12},{"$f":"MIN(E$45,$C47)*E$46","v":2E-12},{"$f":"MAX(0,(MIN($C47,F$45)-E$45))*F$46","v":0},{"$f":"MAX(0,MIN($C47,G$45)-F$45)*G$46","v":0},{"$f":"MAX(0,$C47-G$45)*H$46","v":0}]
[]
[]
[]
[]
[]
[null,null,null,null,"Id","Ordine",0]
[null,null,null,null,1,"Architetti",0.04]
[null,null,null,null,2,"Ingegneri",0.04]
[null,null,null,null,3,"Geometri",0.05]
[null,null,null,null,4,"Periti industriali",0.05]
[null,null,null,null,5,"Geologi",0.02]
[null,null,null,null,6,"Agronomi",0.02]
[null,null,null,null,7,"Non definito",0]
[null,null,null,null,8,"Imprese artigiane",0]
[null,null,null,null,9,"Perito agrario",0.02]
[null,null,null,null,10,"INPS",0]
[null,null,null,null,11,"INAIL",0]

{"sheet":"Versioni","index":5,"n_rows":69,"n_cols":3,"rows_kept":69,"cut":false,"hidden":false,"merged":[]}
["VER","DATA","NOTE"]
[{"$f":"B2","v":"2017-10-19"},"2017-10-19","versione iniziale di sviluppo"]
[{"$f":"B3","v":"2017-11-09"},"2017-11-09","inserito controllo di assicurazione sulle parti comuni \"non negativa\""]
[null,null,"ripartizione spese tecniche spostata su valori ante oneri di cassa"]
[null,null,"forzato ulteriori prestazioni specialistiche a €1000 in caso di valore inferiore al 2% del costo dell'intervento"]
[null,null,"riduzione del 30% per magazzino non applicata in caso di OCSR 13"]
[null,null,"corretta la formula di calcolo degli accolli in caso di anticipi con IVA detraibile"]
[null,null,"corretto calcolo accollo in caso di assicurazione ed assenza di finiture interne"]
[null,null,"inserita maggiorazione Classo II edificio misto pubblico-privato"]
[null,null,"corretto riferimento per incremento 80% convenzionale in caso di abitazione dentro produttivo"]
[null,null,"modificate le maggiorazioni per ca in opera e muratura ex OCSR 41/17"]
[null,null,"inserita gestione IVA pro-rata ex art. 19-bis DPR 633/72"]
[{"$f":"B13","v":"2017-11-14"},"2017-11-14","rimossa maggiorazione rimozione macerie per demolizioni volontarie"]
[null,null,"formula RESTITUIRE per finiture interne ora gestisce meglio condomini misti abitazione-produttivi"]
[{"$f":"B15","v":"2017-11-24"},"2017-11-24","corretta formula contributo per immobile assicurato in decurtazione diretta"]
["2017-12-01","2017-12-01","separate indagini e prove dal resto dei lavori"]
["2017-12-22","2017-12-22","correzione formula di calcolo contributo immobile assicurato RICHIESTA colonna W e AA poi AT AU e AV"]
[null,null,"correzione formula massimo compilazione AeDES RICHIESTA R113"]
[null,null,"correzione conteggio UI principali in edificio RICHIESTA D140"]
[{"$f":"B20","v":"2018-01-12"},"2018-01-12","adeguamento calcolo contributo compilazione AeDES produttivi"]
[null,null,"correzione importo lavori ai fini del calcolo delle indagini e prove"]
[null,null,"specificato il numero di US aggregate volontariamente rispetto alle UMI"]
[{"$f":"B23","v":"2018-01-19"},"2018-01-19","correzione oneri di cassa su tabella riassuntiva"]
[null,null,"correzione formula maggiorazione risparmio energetico"]
[null,null,"correzione maggiorazione per cantieri in quota per edifici riconducibili ad abitativi"]
[null,null,"recepito modifiche alla maggiorazione per vincoli art. 136 ordinanza 8 in seguito alla ordinanza 46"]
[null,null,"correzione formula IVA pro-rata ex art. 19-bis DPR 633/1972"]
[{"$f":"B28","v":"2018-01-26"},"2018-01-26","inserimento formula IVA detraibile al 100% in caso di assenza di pro-rata"]
[null,null,"contributo IVA inclusa colonna AX valutato sul pro-rata"]
[null,null,"correzione alla formula di determinazione UI seconda abitazione"]
[{"$f":"B31","v":"2018-02-02"},"2018-02-02","correzione formula restituzione anticipi in caso di IVA pro-rata"]
[{"$f":"B32","v":"2018-02-23"},"2018-02-23","esclusione dal minimo €6.000 di spese tecniche per interventi su produttivi"]
[null,null,"correzione formula rapporto strutture-finiture per recepire il vincolo architettonico"]
[null,null,"correzione formula restituzione anticipi in caso di IVA detraibile"]
[null,null,"correzione formule per la gestione spese tecniche nelle demolizioni"]
[{"$f":"B36","v":"2018-03-03"},"2018-03-03","correzione formula IVA detraibile pro-rata dentro la singola UI"]
[null,null,"correzione formule detrazione assicurazione sia in caso di condominio che comunione"]
[{"$f":"B38","v":"2018-03-16"},"2018-03-16","applicazione incremento 30% in caso di DR limitatamente alle DELOCALIZZAZIONI"]
[null,null,"gestione assicurazione al lordo dell'IVA"]
[{"$f":"B40","v":"2018-03-30"},"2018-03-30","correzione errore taglio finiture interne RICHIESTA X109"]
[null,null,"modifica al quadro riepilogativo"]
[{"$f":"B42","v":"2018-04-06"},"2018-04-06","correzione formula arrotondamento centesimi ripartizione CONTRIBUTO"]
["2018-04-20","2018-04-20","correzione formula maggiorazione per aggregato per includere aggregati non isolato con 8+ edifici"]
[null,null,"correzione riduzione convenzionale al 70% per produttivi solo in caso di livello operativo L0"]
[null,null,"minimo di €6.000 per spese tecniche non è riconoscibile in caso di demolizione collabente"]
[{"$f":"B46","v":"2018-04-21"},"2018-04-21","riduzione 30% del convenzionale esteso a ordinanza 19 e 4 oltre che 13"]
["2018-05-11","2018-05-11","recepito redistribuzione spese tecniche inferiori a 6mila come da vademecum professionisti"]
[null,null,"correzione formula applicazione IVA alla quota comune del contributo per ogni UI"]
[null,null,"correzione formula applicazione IVA alla assicurazione devoluta alle parti comuni per ogni UI"]
[null,null,"inserita una tabella in DECRETO con esplosione degli accolli delle parti comuni"]
[null,null,"correzione riferimento F109"]
[{"$f":"B52","v":"2018-06-07"},"2018-06-07","correzione formula riconoscimento maggiorazione classe energetica A"]
[null,null,"correzione formula confronto spese tecniche richieste ante oneri"]
[null,null,"corretta attribuzione prioritaria accollo alle finiture interne"]
[null,null,"correzione formula di determinazione IVA sul contributo interno in caso di IVA detraibile"]
[null,null,"spese tecniche collaudo e sicurezza riallocate anche per parcelle superiori a €6mila"]
[{"$f":"B57","v":"2018-06-22"},"2018-06-22","verifica non negatività contributo interno ivato in caso di assicurazione (RICHIESTA-BC)"]
[null,null,"corretta formula in DECRETO su allocazione parti comuni condominio pubblico-privato"]
[null,null,"aggiunta suddivisione del contributo per condomini in tabella A-BIS"]
[null,null,"correzione riconoscimento maggiorazioni da vincoli"]
[{"$f":"B61","v":"2018-07-06"},"2018-07-06","inserito controllo su AeDES inferiore al massimo delle spese tecniche di progettazione"]
["2018-07-25","2018-07-25","corretta formula verifica di presenza prima casa in condominio fuori cratere"]
[null,null,"corretta formula decurtazione finiture internein caso di casa fuori cratere"]
[null,null,"corretta formula ricerca contributo per UI"]
[null,null,"razionalizzata formula determinazione peso contributo comune post assicurazione"]
[{"$f":"B66","v":"2018-08-10"},"2018-08-10","corretto formula taglio parti comuni edificio di seconde case fuori cratere AW BB"]
[{"$f":"B67","v":"2018-10-02"},"2018-10-02","corretto formula del parametrico ponderale"]
[{"$f":"B68","v":"2018-11-15"},"2018-11-15","tolto rapporto strutture-finiture per produttivi non in rafforzamento"]
[null,null,"azzerate le maggiorazioni riconosciute in caso di demolizione senza ricostruzione"]